program: Gaussian 09
title: 000290204
version: EM64L-G09RevD.01
frameworkgroup: C1[X(C19H24N4OS)]
method: RPBEPBE
basis: SDD
operation: Freq
keyword: #p
keyword: freq=noraman
keyword: PBEPBE/SDD
title: #p freq=noraman PBEPBE/SDD
converged: YES YES NO NO
title: Mulliken charges:
elementType: S O N N N N C C C C C C C C C C C C C C C C C C C H H H H H H H H H H H H H H H H H H H H H H H H
charge: 0.292101 -0.439031 -0.136609 -0.471388 -0.097347 0.029828 -0.474896 0.374852 -0.325102 -0.309297 -0.648585 0.482380 0.167951 0.064442 0.435924 0.121197 -0.681780 -0.674096 -0.321842 -0.439159 -0.287090 -0.382596 -0.855773 -0.771564 -0.395296 0.226771 0.233994 0.191803 0.230495 0.188061 0.199813 0.262940 0.343258 0.213334 0.209391 0.213343 0.222047 0.213306 0.208152 0.321009 0.215693 0.235129 0.233756 0.258522 0.241930 0.237004 0.240814 0.245803 0.356410
chargesum: 0.00000
title: Mulliken charges with hydrogens summed into heavy atoms:
elementType: S O N N N N C C C C C C C C C C C C C C C C C C C
charge: 0.292101 -0.082622 -0.136609 -0.128130 -0.097347 0.029828 -0.014131 0.374852 0.097196 0.078577 -0.385645 0.482380 0.167951 0.064442 0.435924 0.121197 -0.045712 -0.030591 -0.000834 -0.439159 -0.287090 -0.166903 -0.128366 -0.051816 -0.149492
polarizability: 4.02791180e+02 2.91580793e+01 3.02144110e+02 -5.04800279e+00 5.81292745e+00 1.44486055e+02
1716.lowfreq: -34.1386 -2.7590 0.0005 0.0007 0.0010 2.7645 6.4368 16.0447 26.5005
frequency: -34.0492 15.9121 26.4524 36.8011 39.2117 49.8742 74.6676 76.4132 90.5104 111.2860 117.5525 144.8383 178.3931 184.4255 190.4328 200.5432 217.3027 230.6652 236.1220 254.4037 259.2082 285.2138 291.1855 300.7436 307.3632 326.0010 354.4802 358.3213 373.1688 413.5782 428.2087 440.2706 453.4936 465.8599 481.5367 495.6911 505.8523 523.4456 549.5432 574.7370 600.2942 606.8985 615.4395 642.5983 662.4703 706.1770 724.4958 752.5181 764.7534 776.3079 786.4118 796.7270 800.5252 806.1140 816.7809 891.2918 897.2839 912.5470 921.1081 926.6930 969.5577 982.7513 989.5507 998.9548 1017.7791 1023.6400 1040.1317 1057.8448 1074.5925 1081.7649 1086.1957 1088.2495 1113.8552 1145.9535 1151.5386 1160.6272 1167.1716 1186.6678 1203.3543 1219.2169 1225.8884 1250.4181 1263.3029 1281.8494 1289.8376 1299.4822 1303.0038 1354.1948 1358.3411 1363.1900 1365.5479 1375.1706 1377.3811 1386.8295 1389.5656 1394.0530 1401.6556 1417.4953 1434.6124 1455.8290 1462.0989 1464.4318 1466.5262 1468.9561 1470.7553 1475.0521 1479.5780 1483.2250 1484.9239 1491.8512 1496.3133 1498.1649 1506.4772 1569.2297 1580.2860 1614.2396 1623.9479 2855.7524 2865.3684 2898.5962 2956.8833 2975.6721 2980.7936 2984.4007 3016.0119 3030.0993 3030.2871 3038.1598 3053.1007 3076.3840 3078.1490 3080.9888 3087.7130 3090.7563 3091.2387 3104.2073 3113.8041 3162.3591 3197.2226 3561.8627 3583.4178
redmass: 1.0290 4.2983 4.1869 3.8650 4.9122 3.4834 3.1039 4.5467 1.9116 2.2178 3.7508 4.4711 4.6296 2.3699 1.9220 2.3385 5.7197 2.0503 1.9507 1.9385 2.2200 3.0053 1.8953 2.8691 2.6363 4.5513 1.1234 3.2320 5.3438 9.1915 2.9520 3.1695 3.4866 3.9763 9.1826 4.1193 6.7544 3.5560 6.3999 2.4437 4.0813 5.6539 4.6853 1.7734 4.6510 5.8374 3.7754 2.8625 4.6376 9.2505 4.2166 1.8016 1.2823 2.2955 1.4303 3.4443 2.1507 2.5047 1.4405 1.4939 1.3115 3.6024 2.3408 1.7712 1.3651 2.1796 1.5038 2.6330 1.9811 2.2701 1.9977 1.9632 1.8935 4.1154 1.2311 1.7105 1.7595 4.1936 2.2921 2.2710 3.4493 1.9931 1.3831 1.7926 1.2159 1.5959 6.4222 1.6091 1.9888 1.9979 1.9156 1.7502 2.5851 1.2465 1.2362 1.3062 1.2029 2.8254 2.6440 1.2466 1.3577 1.0530 1.1479 1.0536 1.5798 1.1592 1.0688 1.3331 1.0646 1.0771 1.0887 3.2529 2.8984 2.7376 5.4373 4.4761 6.6103 1.0723 1.0716 1.0705 1.0401 1.0381 1.0355 1.0357 1.0864 1.0988 1.0886 1.0873 1.0981 1.0987 1.0980 1.1000 1.0949 1.1003 1.0953 1.0906 1.0907 1.0921 1.0944 1.0750 1.0659
irintensity: 0.2175 1.5725 0.0255 0.3906 0.1959 0.5822 0.4832 0.1911 0.3291 1.3337 0.1076 0.0930 3.3530 0.5213 2.6446 1.7874 1.4987 0.9878 6.4146 0.3651 1.6470 4.1094 3.2128 1.2392 4.8548 0.0692 121.6426 0.9841 3.4974 0.1635 2.1286 7.9114 2.6339 2.2491 3.0660 10.0588 14.0395 5.9282 28.6888 32.6687 3.2491 3.6636 0.7020 27.8226 4.8205 4.6681 0.1131 13.3957 2.7428 3.0846 18.7941 2.2910 4.5909 12.7564 44.5499 21.2046 9.0268 24.0350 12.0754 16.6868 6.1507 28.7759 11.9829 11.1829 5.0909 4.3247 0.6361 44.5154 17.4372 95.2026 27.9578 15.7518 14.4746 22.4184 104.0572 58.2965 21.8898 31.2962 47.4523 6.8266 14.9061 76.6006 19.8040 19.8971 22.8233 13.4128 53.2852 11.0184 32.2070 56.1184 31.1925 4.6528 9.5178 17.4632 21.7567 2.2133 15.5539 11.2502 12.8498 8.6520 10.2975 3.8842 23.0013 10.3180 6.3292 8.6632 17.5556 68.2346 12.0494 20.0741 40.9573 454.7075 430.3244 546.9249 25.4577 28.5181 16.5970 38.7349 179.4897 67.4365 28.3871 32.7405 26.6584 29.0995 13.5677 13.4316 12.7777 15.2480 16.0856 23.2198 71.3483 86.6239 19.2699 36.7579 11.2119 18.5422 22.2978 21.3046 14.2849 34.3770 50.3418
temp: 298.150 k
press: 1.00000 atm
elementType: 16 8 7 7 7 7 6 6 6 6 6 6 6 6 6 6 6 6 6 6 6 6 6 6 6 1 1 1 1 1 1 1 1 1 1 1 1 1 1 1 1 1 1 1 1 1 1 1 1
symmnumber: 1
zpe: 1042949.1 jmol-1
zpe.correction: 0.397238 hartree
zpe.thermalcorrener: 0.422068 hartree
zpe.thermalcorrenthalpy: 0.423012 hartree
zpe.thermalcorrgfe: 0.341092 hartree
zpe.sumelectzpe: -1428.860002 hartree
zpe.sumelectthermal: -1428.835172 hartree
zpe.sumelectthermalent: -1428.834228 hartree
zpe.sumelectthermalfe: -1428.916149 hartree
dipole: 3.4819 -3.7113 0.2011
dipole: 5.0929
quadrupole: -166.1821 -135.6185 -160.1330
quadrupole: 19.3041 2.0464 1.1744
quadrupole: -12.2042 18.3594 -6.1552 19.3041 2.0464 1.1744
hfenergy: -1429.2572401 hartree
pointgroup: C01 [X(C19H24N4O1S1)]
dipole: 1.4560158 1.3761353 -0.0323349 debye
polarizability: 398.8767417|-35.2114622|305.5155091|4.5507419|10.7242205|145.0290941 unknown
InChI: InChI=1S/C19H24N4OS/c1-5-23(6-2)10-14-9-15(7-8-16(14)24)22-18-17-12(3)13(4)25-19(17)21-11-20-18/h7-9,11,22,24H,5-6,10H2,1-4H3
charge 0 multiplicity 1
49 atoms
S  -5.620028 0.986464 0.007237
O  4.326339 -3.046918 -0.112963
N  4.125823 1.211302 -0.094445
N  -0.66744 -0.383206 0.02832
N  -2.30499 -2.096153 -0.155011
N  -4.696098 -1.625841 -0.172609
C  4.298836 -0.23605 0.190276
C  3.006464 -1.033671 0.051095
C  4.046389 1.47154 -1.560397
C  5.14637 2.049646 0.591564
C  1.746763 -0.409883 0.090962
C  0.535846 -1.147227 -0.016185
C  -3.049752 0.231544 0.011127
C  3.046163 -2.445797 -0.092818
C  -3.032313 1.688012 0.120816
C  -1.996294 -0.764617 -0.039731
C  3.357149 2.805336 -1.904873
C  4.875632 2.213235 2.099327
C  0.5933 -2.556447 -0.163637
C  -4.366852 -0.311055 -0.061622
C  -4.307485 2.238518 0.130583
C  1.852273 -3.191772 -0.199474
C  -1.790366 2.554909 0.216186
C  -4.709228 3.688126 0.237615
C  -3.619508 -2.454303 -0.214687
H  4.667999 -0.348214 1.227546
H  5.08077 -0.700768 -0.456095
H  5.060656 1.435267 -2.032965
H  3.461204 0.6470 -2.007313
H  6.178274 1.644669 0.433172
H  5.129569 3.050056 0.122878
H  1.746578 0.682301 0.20942
H  -0.50889 0.619541 0.125086
H  2.334757 2.826267 -1.486339
H  3.905523 3.676966 -1.504162
H  3.289924 2.929808 -3.001637
H  3.87958 2.6614 2.260381
H  4.903187 1.246273 2.633377
H  5.638533 2.868873 2.559249
H  -0.335795 -3.120606 -0.244602
H  1.894867 -4.283623 -0.310538
H  -1.191131 2.325154 1.119853
H  -1.141752 2.451193 -0.676494
H  -2.059002 3.621384 0.285714
H  -4.444302 4.109802 1.226023
H  -4.209621 4.303162 -0.533976
H  -5.79645 3.816537 0.105976
H  -3.826581 -3.52446 -0.305984
H  4.246311 -4.024973 -0.236429
