program: Gaussian 09
title: 000290197
version: EM64L-G09RevD.01
frameworkgroup: C1[X(C10H11N3OS)]
method: RPBEPBE
basis: SDD
operation: Freq
keyword: #p
keyword: freq=noraman
keyword: PBEPBE/SDD
title: #p freq=noraman PBEPBE/SDD
converged: NO YES NO YES
title: Mulliken charges:
elementType: S O N N N C C C C C C C C C C H H H H H H H H H H H
charge: 0.275409 -0.273904 -0.010374 -0.424983 -0.621945 0.487924 -0.484167 -0.418085 -0.412656 -0.446613 -0.424787 0.160521 -0.445735 0.125443 0.159246 0.222508 0.252303 0.209800 0.204930 0.208589 0.210945 0.224305 0.225585 0.324895 0.350769 0.320077
chargesum: 0.00000
title: Mulliken charges with hydrogens summed into heavy atoms:
elementType: S O N N N C C C C C C C C C C
charge: 0.275409 -0.273904 -0.010374 -0.100089 0.048902 0.487924 -0.009356 -0.003355 0.006878 0.003277 -0.424787 0.160521 -0.445735 0.125443 0.159246
polarizability: 2.22859991e+02 5.03941249e+00 1.58290458e+02 2.83018230e-01 1.20213756e+00 7.39537026e+01
1716.lowfreq: -0.0007 -0.0005 0.0016 7.1059 8.4540 12.2983 60.6835 93.9115 121.7930
frequency: 60.6742 93.9068 121.7910 162.7896 170.6181 189.5032 246.9857 257.8738 285.5185 303.9361 341.9527 350.2679 354.0823 405.6949 453.9548 483.5716 495.8807 529.6231 553.4189 574.8614 599.6990 602.5364 634.4467 681.9131 697.7297 764.2589 777.0941 817.8321 843.7724 887.1304 900.2757 943.4956 957.3429 997.2501 1008.4024 1033.7830 1080.5988 1093.1214 1131.4188 1134.9328 1167.5573 1182.0727 1237.5977 1255.3902 1298.9922 1312.7723 1323.6740 1328.5219 1342.9234 1346.3093 1409.0716 1453.1910 1461.3991 1466.6553 1472.0143 1473.2656 1483.4728 1577.1781 1585.0442 1624.0751 1645.8774 2960.1349 2977.5529 2980.6822 2984.5780 3016.1664 3042.9676 3047.8756 3055.4271 3507.5061 3561.2670 3712.5391
redmass: 4.4952 3.3785 2.9025 5.2651 5.7259 5.6013 3.0883 1.1770 2.1519 3.2704 8.3840 3.8400 5.5146 6.7157 4.5632 3.6961 1.1855 3.6487 6.3969 5.1151 3.0671 4.6186 4.6935 4.7581 1.9308 5.2013 3.3765 1.5121 2.8429 7.3587 1.4766 4.5473 2.6150 3.2090 3.8440 1.7851 1.8665 1.8601 2.9395 1.2340 1.6644 2.8610 1.2843 1.2410 2.5540 1.6860 1.9472 1.5718 1.5442 1.5629 6.2082 1.1404 1.0868 1.1386 1.1185 5.5223 7.0237 2.3539 6.1487 1.8615 4.6074 1.0632 1.0695 1.0615 1.0629 1.0945 1.0958 1.0986 1.1013 1.0774 1.0454 1.1053
irintensity: 6.7317 0.1572 4.3971 5.4438 0.1368 0.2854 0.0968 98.2436 6.3838 3.0222 2.1447 4.6645 4.5494 1.7396 0.6681 2.0038 222.8840 1.9943 4.3314 2.2074 7.8091 9.4074 2.3773 51.3700 44.0597 23.0552 10.4612 6.0957 8.0753 65.3087 0.5730 11.3397 7.2858 2.1889 2.8716 4.7038 0.3291 3.4163 6.3150 4.7224 2.6271 13.0867 5.5741 0.7822 11.7747 62.6081 35.2629 13.9308 8.0202 4.7484 11.2225 3.3695 13.9301 12.9204 4.4954 44.0900 26.6901 340.3412 25.2152 695.8011 433.5067 39.7362 17.3986 36.9873 33.4300 34.5350 62.8653 25.9454 54.9980 25.3713 153.9189 45.8032
temp: 298.150 k
press: 1.00000 atm
elementType: 16 8 7 7 7 6 6 6 6 6 6 6 6 6 6 1 1 1 1 1 1 1 1 1 1 1
symmnumber: 1
zpe: 528257.1 jmol-1
zpe.correction: 0.201203 hartree
zpe.thermalcorrener: 0.214185 hartree
zpe.thermalcorrenthalpy: 0.215130 hartree
zpe.thermalcorrgfe: 0.162194 hartree
zpe.sumelectzpe: -1024.157579 hartree
zpe.sumelectthermal: -1024.144596 hartree
zpe.sumelectthermalent: -1024.143652 hartree
zpe.sumelectthermalfe: -1024.196587 hartree
dipole: 3.0172 -0.4801 0.0149
dipole: 3.0552
quadrupole: -54.5946 -106.2944 -97.0400
quadrupole: 3.5914 0.1420 -0.1081
quadrupole: 31.3817 -20.3181 -11.0637 3.5914 0.1420 -0.1081
hfenergy: -1024.3587811 hartree
pointgroup: C01 [X(C10H11N3O1S1)]
dipole: 1.1901146 0.1685809 -0.0044175 debye
dipolederiv: -0.3863547 0.0562871 -0.0093836 0.2447606 -0.2254 -0.007455 0.003924 -0.0107919 0.071288 -0.5024228 -0.0765616 -0.0038159 -0.0516457 -1.3777905 -0.0239985 0.0030214 -0.0228502 -0.3596695 -1.7201682 -0.0960466 0.0008474 0.6189709 -0.517615 -0.0063557 0.0238031 -0.0070055 -0.2410412 -0.729575 -0.3783777 -0.0074636 -0.1375537 -0.6646424 -0.0091168 -0.0001924 -0.0086507 -0.2869395 -1.9502417 -0.1308491 -0.0000314 -0.1780426 -0.2254941 0.0137322 -0.0031245 0.0134631 -0.7366683 -0.0995248 0.0136592 0.0142242 0.2687495 -0.015131 -0.0011362 0.0661927 0.0296523 -0.0181605 0.0770437 0.034075 -0.0045194 -0.0054483 -0.0017078 0.0180186 -0.0172305 0.0102107 0.1499943 0.0913244 0.0522757 0.0143011 0.0218911 0.0570775 0.0284531 -0.0371994 0.0091671 0.1396229 0.0972114 -0.0023422 -0.0301181 0.1237299 0.0461589 0.0211275 0.0411242 0.0348216 0.1366825 0.0355973 -0.0808542 -0.0263185 -0.1165023 -0.0051113 -0.0124232 0.0172684 -0.0320626 0.1991199 0.2871648 0.2525798 0.0090466 -0.0315183 0.1788839 0.0102479 -0.0749903 0.0244601 -0.2156598 -0.1326949 0.1520475 0.0047713 -0.068068 -0.9159538 -0.0144845 -0.0059976 -0.023064 -0.0250384 1.217358 -0.0483479 -0.0010468 -0.3305153 0.6721983 0.0123761 -0.0177406 0.0233186 -0.0600101 0.9295609 0.1099591 0.0024269 0.1600903 1.6882821 0.0365387 0.0046884 0.0328494 0.2160632 2.3210556 0.1128529 -0.004475 -0.5293739 0.8661542 0.0149728 -0.0206718 0.013011 0.263098 0.0201813 -0.0496063 0.0066518 -0.0500203 0.0099183 -0.0628724 0.0068918 -0.1008516 -0.0970159 0.0323121 0.0457993 -0.0447577 0.0058487 -0.0126732 0.0660631 -0.0346876 0.0783008 0.0281663 -0.084344 -0.126719 -0.0149101 -0.1615554 -0.1103112 -0.0167274 -0.0447303 -0.039549 0.0740472 0.0508794 0.0197206 -0.0030772 0.0609679 0.0574344 -0.0550595 0.0465679 0.003968 -0.1787745 -0.2605291 0.0452598 0.0174288 0.0334841 0.0435283 -0.0050311 0.0494544 -0.0118457 0.0757873 0.0994698 -0.0040688 0.0414881 -0.0302371 0.0206248 -0.0334192 -0.0353177 -0.0181217 -0.1731714 -0.0816725 0.0519295 0.0436902 0.0247167 0.0448913 -0.0558277 0.0944336 -0.1070696 -0.1026274 0.00571 0.0177656 -0.0072745 0.0524791 -0.0842674 0.0984511 -0.0698006 0.1241718 0.0144259 0.1473061 -0.0205371 -0.000184 0.0135652 0.1428845 -0.0042196 0.0007093 -0.0038724 0.3299514 0.2598913 0.045161 0.0017985 0.1128234 0.1914293 -0.0053972 0.0034003 -0.0048752 0.3965843 0.2754619 0.0049385 0.0007007 -0.0515967 0.136632 -0.006457 0.000204 -0.0067843 0.3999453 unknown
polarizability: 222.6687333|-6.1384385|158.4555006|-0.3101735|1.9163285|73.9799174 unknown
InChI: InChI=1S/C10H11N3OS/c11-10-12-8(14)7-5-3-1-2-4-6(5)15-9(7)13-10/h12H,1-4,11H2
charge 0 multiplicity 1
26 atoms
S  -0.342237 2.335315 0.065969
O  0.922058 -2.627942 -0.059839
N  2.256438 1.347678 0.030125
N  2.61293 -1.017312 -0.026976
N  4.444152 0.506263 0.002793
C  -1.119857 -0.230953 -0.00113
C  -2.015345 -1.456541 -0.028559
C  -3.471323 -1.098547 0.35844
C  -3.954957 0.179735 -0.36815
C  -3.105985 1.414067 0.042243
C  -1.64325 1.049647 0.031224
C  0.330349 -0.242793 -0.008709
C  0.918595 1.045262 0.025089
C  1.216433 -1.393776 -0.033816
C  3.080563 0.291961 0.002259
H  -1.989627 -1.901894 -1.043709
H  -1.604605 -2.233186 0.640938
H  -4.138092 -1.948465 0.120072
H  -3.533556 -0.936063 1.453434
H  -5.019982 0.37579 -0.142101
H  -3.873447 0.028627 -1.462587
H  -3.407134 1.756239 1.0544
H  -3.307846 2.258507 -0.645306
H  3.255148 -1.815802 -0.045313
H  4.756275 1.474103 0.024921
H  5.125902 -0.245922 -0.01941
