program: Gaussian 09
title: 000290189
version: EM64L-G09RevD.01
frameworkgroup: C1[X(C7H6I2N2O)]
method: RPBEPBE
basis: SDD
operation: Freq
keyword: #p
keyword: freq=noraman
keyword: PBEPBE/SDD
title: #p freq=noraman PBEPBE/SDD
converged: YES YES NO NO
title: Mulliken charges:
elementType: I I O N N C C C C C C C H H H H H H
charge: 0.106992 0.101970 -0.335870 -0.669677 -0.636203 0.203985 0.473297 -0.190910 -0.532103 -0.421451 -0.135752 0.199164 0.204884 0.270607 0.305591 0.385465 0.326338 0.343672
chargesum: 0.00000
title: Mulliken charges with hydrogens summed into heavy atoms:
elementType: I I O N N C C C C C C C
charge: 0.106992 0.101970 -0.335870 0.021380 0.033807 0.203985 0.473297 0.013975 -0.532103 -0.421451 0.134855 0.199164
polarizability: 2.15478726e+02 6.78387255e-04 1.76682728e+02 -2.15945920e-01 -2.44266804e-02 4.40366565e+01
1716.lowfreq: -33.5915 -3.6963 -0.0003 -0.0001 0.0003 3.9912 5.9541 85.9723 89.6218
frequency: -33.5821 85.9690 89.6087 104.6211 131.7206 167.6276 196.4952 260.1950 306.2758 340.0417 392.8264 407.2123 412.0262 467.2688 515.8384 523.9615 541.6370 581.7595 621.4215 635.1696 697.1410 760.3243 760.6020 833.5681 840.5482 854.5499 892.5384 1039.5148 1052.3012 1107.5200 1118.2289 1264.4660 1310.3616 1342.3264 1394.2825 1399.9451 1443.1050 1497.1831 1542.8026 1593.4430 1607.1118 1634.4837 3160.2468 3178.9610 3290.3905 3543.0515 3594.3371 3695.0851
redmass: 3.9555 9.0248 25.5103 5.6791 10.5112 4.3599 16.0912 7.6179 5.8088 4.8267 5.9059 1.6779 5.1678 2.1743 1.1621 3.1486 2.7815 1.3027 5.2088 7.2151 6.6742 4.0511 5.2261 6.1824 1.1406 1.6948 1.3645 2.2678 2.3675 2.5719 2.0923 1.3368 2.2431 3.6689 5.7916 4.9772 2.6468 4.0627 5.9223 1.3773 4.8861 1.5864 1.0907 1.0933 1.0612 1.0455 1.0907 1.1035
irintensity: 12.0247 0.2706 0.0078 3.3596 0.7983 0.1869 0.9589 2.4756 0.9973 16.3589 3.4574 31.9054 2.6487 61.3695 90.6514 2.0348 37.6312 206.2944 30.8788 82.3784 2.7425 7.6190 2.0798 15.9894 187.4661 4.9725 3.8454 0.5388 91.3694 7.1983 2.0101 27.2264 31.6984 277.9585 3.4318 123.3500 29.1710 319.2778 67.8998 174.6050 197.7416 139.1989 8.7313 0.0029 212.3729 64.2264 87.7659 35.2897
temp: 298.150 k
press: 1.00000 atm
elementType: 53 53 8 7 7 6 6 6 6 6 6 6 1 1 1 1 1 1
symmnumber: 1
zpe: 318386.7 jmol-1
zpe.correction: 0.121267 hartree
zpe.thermalcorrener: 0.132429 hartree
zpe.thermalcorrenthalpy: 0.133373 hartree
zpe.thermalcorrgfe: 0.081281 hartree
zpe.sumelectzpe: -477.253359 hartree
zpe.sumelectthermal: -477.242198 hartree
zpe.sumelectthermalent: -477.241253 hartree
zpe.sumelectthermalfe: -477.293345 hartree
dipole: -1.3111 1.1607 0.0329
dipole: 1.7514
quadrupole: -89.4307 -92.6910 -104.5552
quadrupole: -13.0548 -0.1077 0.1770
quadrupole: 6.1283 2.8680 -8.9963 -13.0548 -0.1077 0.1770
hfenergy: -477.3746262 hartree
pointgroup: C01 [X(C7H6I2N2O1)]
dipole: -0.4025373 -0.5316815 0.1733709 debye
dipolederiv: -0.1476133 -0.193482 0.0591339 -0.1766566 -0.3819882 0.1069201 0.0547256 0.1087801 -0.0154587 -0.1639044 0.2041537 -0.0302736 0.2334554 -0.3744483 0.062856 -0.0364768 0.0656133 -0.0085247 -1.0424785 0.2304782 0.0078024 0.1743678 -0.8026225 0.0846143 0.0239333 0.0784482 -0.4081876 -0.6664357 0.5102001 -0.1119208 0.4397863 -1.0987493 0.0719188 -0.0969158 0.0640763 -0.6151646 -0.7573563 -0.4869128 0.1242774 -0.6122022 -0.9082672 0.1106885 0.1545508 0.0988555 -0.7292495 -0.9542401 -0.3435273 0.1686234 0.4306649 -0.0972338 -0.0251489 -0.0117635 0.0487224 -0.0460294 0.2865996 -0.7653069 0.1663643 -0.7381656 0.6639463 -0.0476252 0.1598913 -0.046279 0.1625858 0.3970007 0.2122554 -0.0936235 -0.1184514 -0.3232099 0.0677512 -0.0136869 0.0354367 -0.0800694 0.167597 0.91756 -0.2470946 0.4863051 0.6096619 -0.2330703 -0.1476233 -0.2741079 -0.141484 -0.1321096 -0.6862136 0.1486443 -0.7544405 0.593063 -0.1070739 0.1623449 -0.1132149 -0.1978939 -0.1414152 0.001243 0.0144641 0.2741016 -0.1136459 -0.0008018 -0.0477514 0.0252227 0.0069607 1.9359016 0.3509092 -0.2463013 0.3527892 1.1856408 -0.2609279 -0.2505867 -0.2580686 0.3456444 0.0558921 -0.1016997 0.0322397 -0.0999514 -0.0245016 0.0488335 0.0314473 0.048816 0.1313874 -0.0038666 -0.0084752 0.0169593 -0.0074806 0.1290752 0.0060614 0.0169327 0.0062999 0.1499408 0.2542988 -0.0390926 0.0187622 -0.0482882 0.250735 0.0281421 0.0210397 0.0276593 0.3436567 0.4482403 0.0698913 -0.0257196 0.0373773 0.326203 0.0035301 -0.017396 0.0009121 0.3610764 0.2334111 0.0811433 -0.0058216 0.0917793 0.178124 0.0398391 -0.0088227 0.0410451 0.369782 0.2304783 0.0468761 0.003484 0.0350096 0.1882176 0.0434928 0.0061573 0.0417828 0.3710276 unknown
polarizability: 175.870032|-6.3342406|206.8038264|-11.2588105|-36.6775566|53.5242527 unknown
InChI: InChI=1S/C7H6I2N2O/c8-3-1-4(7(11)12)6(10)5(9)2-3/h1-2H,10-11H2
charge 0 multiplicity 1
18 atoms
I  2.331548 3.010539 -0.738938
I  2.579922 -2.969008 0.594702
O  -3.005228 0.929515 0.237584
N  -0.871144 2.335384 -0.290616
N  -2.859388 -1.299247 0.759292
C  -0.771816 -0.057651 0.256372
C  -0.133622 1.197906 -0.095706
C  0.023603 -1.218754 0.446555
C  1.299202 1.185017 -0.227248
C  1.417064 -1.181264 0.302709
C  2.069363 0.03002 -0.036544
C  -2.259702 -0.103049 0.412175
H  -0.440135 -2.172967 0.710063
H  3.155406 0.065476 -0.148595
H  -0.411709 3.210585 -0.537544
H  -1.894815 2.244872 -0.175038
H  -2.356423 -2.166189 0.922687
H  -3.873826 -1.291685 0.855589
