program: Gaussian 09
title: 000290187
version: EM64L-G09RevD.01
frameworkgroup: C1[X(C9H10Cl2N4O)]
method: RPBEPBE
basis: SDD
operation: Freq
keyword: #p
keyword: freq=noraman
keyword: PBEPBE/SDD
title: #p freq=noraman PBEPBE/SDD
converged: YES YES NO NO
title: Mulliken charges:
elementType: Cl Cl O N N N N C C C C C C C C C H H H H H H H H H H
charge: -0.043049 -0.052773 -0.281727 -0.041653 -0.144129 -0.024361 -0.623128 0.379781 0.304228 -0.478020 -0.349043 -0.278872 -0.086215 0.178306 -0.613881 -0.598649 0.314677 0.295866 0.265465 0.265892 0.221361 0.237326 0.237098 0.262576 0.317024 0.335902
chargesum: 0.00000
title: Mulliken charges with hydrogens summed into heavy atoms:
elementType: Cl Cl O N N N N C C C C C C C C C
charge: -0.043049 -0.052773 -0.281727 -0.041653 -0.144129 -0.024361 0.029797 0.379781 0.304228 -0.478020 -0.034367 0.016994 -0.086215 0.178306 0.138837 0.138350
polarizability: 2.66353540e+02 8.75635975e+00 1.89175289e+02 -2.78062893e-02 2.48441120e-02 6.63153382e+01
1716.lowfreq: -5.1744 -4.8059 -0.0031 -0.0020 -0.0012 1.5599 13.7393 17.9223 45.2852
frequency: 12.7202 17.5580 45.2846 71.9991 83.8736 91.6352 130.8707 158.4736 158.6707 208.4525 219.9468 233.1267 264.9822 274.1361 307.7790 346.0528 349.7753 383.2606 387.8992 425.7754 473.9010 480.4950 561.0754 575.9082 582.1516 604.6944 617.7149 620.4199 678.8463 718.9260 764.1794 810.8504 846.2973 911.4236 939.4364 948.5990 1005.7170 1037.3422 1069.4896 1079.6227 1082.9636 1107.2622 1127.8920 1176.5175 1207.5364 1285.8566 1316.4839 1339.6836 1352.8656 1361.5622 1396.4455 1408.4518 1417.6497 1439.6549 1441.8602 1467.6497 1478.9764 1489.6515 1541.1456 1576.3044 1586.1571 1628.3199 2975.1780 2989.9392 3052.9059 3068.8207 3122.1123 3126.5292 3167.5346 3178.7982 3486.9693 3650.5911
redmass: 2.9693 6.2468 7.7731 5.1357 2.1764 1.8220 1.6541 7.9131 2.8081 2.3389 4.7764 8.5538 4.9374 7.3670 19.7275 6.7474 4.5697 6.0598 6.8460 3.2138 6.9567 3.2032 4.5291 3.9883 1.1768 4.9573 5.9640 1.4620 6.1700 4.5052 5.1614 7.8281 4.5695 1.5208 1.3928 7.6170 7.6170 1.4663 2.1649 1.9029 1.2464 1.5297 1.3544 2.2079 2.7003 4.7873 4.2189 4.5309 4.0724 5.3241 3.8197 4.8822 1.1519 1.0438 1.2623 1.0453 1.0702 1.1618 5.7503 2.4553 5.8024 2.1296 1.0354 1.0335 1.1020 1.0997 1.1011 1.0989 1.0919 1.0921 1.0466 1.1032
irintensity: 0.4573 9.2269 1.3761 0.8091 3.1020 0.0831 0.4820 0.8717 1.2975 5.0957 6.0466 0.0573 0.0650 2.4514 0.1807 1.8135 32.9311 1.5310 1.9785 7.5714 8.3765 0.1603 46.6404 7.5559 134.0868 3.6438 22.1131 135.2707 3.1865 15.0199 16.9752 38.9526 11.4177 29.3518 13.1003 34.2193 57.8345 17.7321 114.9947 0.3466 0.0890 14.0541 0.5075 13.7410 5.3763 9.0194 10.8247 442.1286 223.1978 89.4665 127.3705 31.4462 18.2679 19.8501 25.3628 13.9021 22.9009 68.3464 182.5300 93.6012 35.8500 226.4716 76.3959 43.5837 29.6931 14.8859 8.4285 14.0640 26.0218 1.4132 49.9617 113.6704
temp: 298.150 k
press: 1.00000 atm
elementType: 17 17 8 7 7 7 7 6 6 6 6 6 6 6 6 6 1 1 1 1 1 1 1 1 1 1
symmnumber: 1
zpe: 487775.1 jmol-1
zpe.correction: 0.185784 hartree
zpe.thermalcorrener: 0.202512 hartree
zpe.thermalcorrenthalpy: 0.203456 hartree
zpe.thermalcorrgfe: 0.137973 hartree
zpe.sumelectzpe: -1562.091289 hartree
zpe.sumelectthermal: -1562.074561 hartree
zpe.sumelectthermalent: -1562.073616 hartree
zpe.sumelectthermalfe: -1562.139100 hartree
dipole: -7.6946 -2.7321 -0.0056
dipole: 8.1652
quadrupole: -91.4257 -101.0419 -109.0462
quadrupole: -8.9955 -0.0518 0.0212
quadrupole: 9.0789 -0.5373 -8.5416 -8.9955 -0.0518 0.0212
hfenergy: -1562.2770723 hartree
pointgroup: C01 [X(C9H10Cl2N4O1)]
dipole: 2.9906037 1.1195968 -0.3501883 debye
dipolederiv: -0.1255372 -0.0780169 0.0235671 -0.0329095 -0.6745395 0.1888209 0.009474 0.1892686 -0.100533 -0.1647149 -0.1077742 0.0327319 -0.2274141 -0.8299599 0.2284618 0.0687169 0.2281368 -0.1401501 -1.1449417 -0.1661245 0.0547266 0.030525 -0.655239 0.0865257 -0.0051175 0.0871275 -0.39693 -1.6565952 0.0039449 0.003644 -0.4505415 -0.1364348 -0.0284068 0.1546955 -0.0296795 -0.2297758 -1.4619006 -0.1394943 0.0467692 0.7859805 -0.098606 -0.0141165 -0.2299403 -0.0107848 -0.1319736 1.926741 0.0941619 -0.0364481 -0.0093896 -0.2328919 0.05883 -0.0086971 0.0588613 -0.0539778 -0.5229729 0.1577392 -0.0485469 0.1499111 -1.0796741 0.124725 -0.0465095 0.1253283 -0.7056961 -0.3579372 0.2869499 -0.084172 0.1378118 -0.2081575 0.0838372 -0.0389314 0.0828777 0.0481947 1.1021654 0.151719 -0.0494634 0.2919312 -0.1456617 0.0634215 -0.0920244 0.0640631 0.0517927 -0.1346176 -0.0164018 0.0050623 0.1748954 0.874794 -0.2980443 -0.0524144 -0.297425 -0.030911 -0.2493779 0.0310567 -0.0088394 -0.2284525 -0.3657893 0.0822005 0.0689215 0.0808272 -0.1193334 -0.2922735 -0.0199823 0.0066457 -0.2962292 -0.3105644 0.0640526 0.0896106 0.0630609 -0.1208313 0.1358045 0.1099185 -0.0338881 0.4018229 1.315605 -0.4132101 -0.1214672 -0.4121376 0.0681937 1.5506778 -0.1001909 0.0228935 -0.345919 1.3572125 -0.3399224 0.0974086 -0.3402004 0.3358956 0.1652733 0.0566663 -0.0173389 0.1927684 0.1744122 0.0056722 -0.0614717 0.0052655 0.1903208 0.5415433 -0.1506774 0.0461208 -0.4747003 0.1079723 0.0407231 0.136944 0.0392538 0.2315235 0.1700442 -0.0714404 0.0214577 -0.042472 0.1376152 0.0087666 0.0127736 0.0092181 0.1635202 0.0978858 0.0648855 -0.0190836 0.0551726 0.0766098 0.0252931 -0.0162958 0.025224 0.1544889 0.0762736 0.075498 0.06273 -0.0624322 -0.0108181 -0.0362664 0.0348329 -0.0731408 -0.0050031 0.0757482 0.0298123 -0.0959621 -0.0691289 0.0418582 0.007029 0.0022896 0.042191 -0.0538293 -0.1572918 -0.0638366 0.021453 -0.0243364 0.0891301 0.0101088 0.0098146 0.0106304 0.1204519 -0.1307597 0.0079164 -0.0897747 0.0151093 0.0568327 -0.0992258 -0.1820559 -0.0551918 -0.0328512 -0.1291334 0.0550038 0.0723136 0.1068305 0.1016955 0.0134543 0.1437942 -0.029683 -0.0752114 0.1162793 -0.0921887 0.0262045 -0.0021633 -0.03044 0.0478384 0.0005203 0.0483532 0.1197799 0.4226837 -0.096069 0.0290384 -0.0517988 0.2180697 0.0436466 0.0161037 0.0431261 0.3485757 0.1469333 -0.0230756 0.0081589 -0.0248716 0.2269691 0.045785 0.0090252 0.0454291 0.3642693 unknown
polarizability: 265.6980996|10.5648286|179.5972771|-3.9436055|-34.0430481|76.5487908 unknown
InChI: InChI=1S/C9H10Cl2N4O/c1-15(2)14-13-7-4-5(10)3-6(8(7)11)9(12)16/h3-4H,12H2,1-2H3
charge 0 multiplicity 1
26 atoms
Cl -0.309456 2.419946 -0.496151
Cl -1.415452 -3.662011 1.330581
O  -4.472382 0.36335 0.138694
N  3.914877 0.118276 0.172833
N  1.710305 0.42752 0.091084
N  2.689242 -0.426001 0.341819
N  -3.362296 2.291382 -0.451697
C  -2.049343 0.238163 0.163487
C  0.415429 -0.138608 0.265849
C  -0.713621 0.700096 0.019828
C  -2.235881 -1.112091 0.56916
C  0.184972 -1.483731 0.669549
C  -1.129913 -1.935859 0.811144
C  -3.373669 0.974502 -0.0522
C  4.097393 1.51973 -0.245711
C  5.058967 -0.760135 0.435509
H  -3.267878 -1.458167 0.67821
H  1.045347 -2.130158 0.858895
H  3.622496 2.203164 0.481383
H  3.607126 1.696002 -1.220206
H  5.176359 1.726744 -0.316854
H  5.682711 -0.361639 1.257505
H  5.689765 -0.866257 -0.466669
H  4.670267 -1.748205 0.723456
H  -2.501068 2.813914 -0.613184
H  -4.270299 2.736777 -0.581614
