program: Gaussian 09
title: 000290175
version: EM64L-G09RevD.01
frameworkgroup: C1[X(C7H10N2)]
method: RPBEPBE
basis: SDD
operation: Freq
keyword: #pfreq=noraman
keyword: PBEPBE/SDD
title: #p freq=noraman PBEPBE/SDD
converged: YES YES NO NO
title: Mulliken charges:
elementType: N N C C C C C C C H H H H H H H H H H
charge: -0.662943 -0.059938 -0.396832 -0.411378 -0.502172 -0.496532 0.229968 0.206058 -0.318913 0.209878 0.212947 0.212971 0.208934 0.238998 0.222462 0.220351 0.230803 0.345541 0.309795
chargesum: 0.00000
title: Mulliken charges with hydrogens summed into heavy atoms:
elementType: N N C C C C C C C
charge: -0.007606 -0.059938 0.025993 0.010527 -0.040711 -0.045378 0.229968 0.206058 -0.318913
polarizability: 1.07554038e+02 9.04143029e+00 9.52773275e+01 -7.15751051e-01 -1.15688392e+00 5.43879175e+01
1716.lowfreq: -14.1113 -0.0009 -0.0006 -0.0005 1.4567 9.2268 96.0866 124.3658 129.9505
frequency: 96.0675 124.3488 129.9461 244.4054 300.1366 336.5585 359.4679 421.0193 444.0978 467.8821 534.5203 547.7400 592.4524 628.6629 669.9927 825.6405 855.6664 885.9376 910.0616 950.2281 1034.3777 1083.5957 1098.0812 1138.6732 1150.5975 1173.0172 1212.8066 1247.4284 1264.6245 1306.1988 1335.6698 1344.8538 1352.4763 1402.8952 1451.9243 1467.1163 1469.3543 1479.3719 1621.7395 1651.4113 2128.7846 2959.1360 2961.5615 2982.0439 2988.1016 3012.9504 3023.2984 3046.4591 3055.4853 3528.9619 3679.7555
redmass: 3.2284 2.6468 6.4100 3.3110 1.7337 3.6063 1.1429 3.5070 2.7570 3.5410 1.3822 3.3483 3.3741 3.5029 3.8964 1.4591 2.4372 2.2323 1.4564 2.3768 1.6656 1.8216 1.7919 1.1780 2.2934 1.5778 3.5494 1.2773 1.2447 1.4593 1.4367 1.4336 1.5572 3.9997 1.0937 1.0834 1.0947 1.0905 1.7815 2.1695 12.5739 1.0655 1.0598 1.0634 1.0654 1.0955 1.0946 1.0990 1.1043 1.0467 1.1023
irintensity: 0.7957 0.4588 4.7172 0.8446 1.6853 3.6511 127.8328 0.1905 22.5449 26.8876 88.7929 12.3112 1.5342 14.0054 0.5756 6.1730 3.2264 7.1426 2.1087 2.5579 4.7201 0.6788 0.2638 2.5932 2.9259 5.0663 35.3718 5.1759 6.0596 2.5118 1.3396 0.7043 2.5952 44.7294 13.3000 11.6079 8.0328 3.1606 53.3061 256.6960 113.3564 41.5616 37.3317 28.2978 23.5514 43.7740 24.7936 55.7090 64.2082 46.2425 32.1632
temp: 298.150 k
press: 1.00000 atm
elementType: 7 7 6 6 6 6 6 6 6 1 1 1 1 1 1 1 1 1 1
symmnumber: 1
zpe: 418558.9 jmol-1
zpe.correction: 0.159421 hartree
zpe.thermalcorrener: 0.168188 hartree
zpe.thermalcorrenthalpy: 0.169132 hartree
zpe.thermalcorrgfe: 0.126117 hartree
zpe.sumelectzpe: -381.558500 hartree
zpe.sumelectthermal: -381.549732 hartree
zpe.sumelectthermalent: -381.548788 hartree
zpe.sumelectthermalfe: -381.591804 hartree
dipole: 4.7550 3.1396 -0.1678
dipole: 5.7005
quadrupole: -67.0745 -45.2103 -55.4052
quadrupole: -6.6213 0.4730 -0.2041
quadrupole: -11.1779 10.6864 0.4915 -6.6213 0.4730 -0.2041
hfenergy: -381.7179204 hartree
pointgroup: C01 [X(C7H10N2)]
dipole: 1.9743224 -1.0618461 0.066318 debye
dipolederiv: -0.2831189 -0.6316927 0.0215295 0.0036837 -1.1781521 0.0402863 -0.0252862 0.0766464 -0.6610174 -0.7202712 0.2232704 -0.0178933 0.0219294 -0.2707218 0.0008733 -0.0052205 0.0041922 -0.2855214 0.1310791 0.0216131 0.0317066 0.0577805 0.0246397 -0.0174983 -0.0084302 -0.0327646 0.1301013 0.0601414 0.0271977 -0.0116791 -0.0093215 0.0308597 -0.0305487 0.0386633 -0.0080572 0.1420943 -0.0340345 -0.1127197 0.0103652 0.0235148 0.0382033 0.0281056 -0.0656024 0.0538984 0.1606138 0.0422392 0.0911748 -0.0244243 0.1340953 0.1814268 -0.0204087 -0.0302096 0.0040897 0.2094087 0.3378248 0.3056947 0.000607 -0.3418026 1.4190382 -0.071251 0.0979558 -0.0704497 0.0604889 -0.5130081 0.4700169 -0.0338128 0.2087905 -0.343696 0.0218376 -0.0414461 -0.0548655 -0.1234911 0.7834824 -0.4464109 0.0304899 -0.128654 -0.124723 -0.0029072 0.0147704 -0.002408 0.0201802 -0.226442 0.0339099 -0.0183474 0.0379626 0.0503783 0.0030059 -0.0536706 0.0083007 0.0765081 0.0937641 -0.0028016 -0.0417441 -0.0212925 0.0204588 0.0290984 0.0249286 0.0184689 -0.1694057 -0.0516441 -0.125223 0.0149733 -0.133312 -0.1251979 0.0217532 0.0349213 0.0433845 0.0745062 0.0467655 0.0239593 -0.0033276 0.0482033 0.0653974 0.0551254 -0.0392234 -0.0031898 -0.1770115 -0.027181 0.0377612 -0.037294 0.012202 0.0452872 0.046269 -0.059916 0.1003225 -0.1019294 0.0188363 0.0128989 0.0100593 0.044485 -0.130184 -0.1050986 0.0635473 -0.1368467 0.0252821 0.0351764 -0.076452 -0.0026667 -0.0450234 -0.0335231 0.0744513 -0.0040619 0.1421864 -0.1231828 0.0109046 0.0596194 0.0613555 0.0366325 -0.0737353 -0.0775664 0.0494515 -0.118841 0.0136271 0.1134653 0.0582211 0.0018234 0.0239301 0.1882914 0.0056943 -0.0042124 -0.0007717 0.3679065 0.1820207 0.0299625 0.0082797 0.0261962 0.2159525 -0.0012213 0.013041 -0.0232954 0.3608422 unknown
polarizability: 109.0766016|-7.7961418|93.7474961|0.7243123|-1.2527948|54.3951857 unknown
InChI: InChI=1S/C7H10N2/c8-5-6-3-1-2-4-7(6)9/h1-4,9H2
charge 0 multiplicity 1
19 atoms
N  -0.668991 -2.127249 0.097869
N  -3.109043 0.471619 -0.057488
C  2.369978 0.09329 -0.37538
C  1.812747 1.342446 0.340884
C  1.594497 -1.168512 0.06258
C  0.339761 1.585842 -0.056304
C  0.086508 -0.966259 0.040634
C  -0.486046 0.299622 -0.0099
C  -1.908599 0.404671 -0.037395
H  3.444991 -0.039294 -0.15156
H  2.277585 0.227171 -1.470982
H  2.417266 2.233728 0.088656
H  1.886028 1.196574 1.437173
H  1.895521 -1.451351 1.092683
H  1.857401 -2.026227 -0.589175
H  0.298773 2.019359 -1.077321
H  -0.112881 2.339474 0.615834
H  -1.687701 -2.083885 0.116546
H  -0.220995 -3.039219 0.095047
