program: Gaussian 09
title: 000290174
version: EM64L-G09RevD.01
frameworkgroup: C1[X(C12H13N2P)]
method: RPBEPBE
basis: SDD
operation: Freq
keyword: #p
keyword: freq=noraman
keyword: PBEPBE/SDD
title: #p freq=noraman PBEPBE/SDD
converged: YES YES NO NO
title: Mulliken charges:
elementType: P N N C C C C C C C C C C C C H H H H H H H H H H H H H
charge: 0.625704 -0.656921 -0.050002 -0.704741 -0.495227 -0.867001 0.254411 0.228728 -0.147033 -0.255225 -0.276437 -0.316743 -0.241740 -0.232021 -0.233933 0.270793 0.246200 0.231308 0.256371 0.267520 0.269132 0.246440 0.227588 0.314333 0.350390 0.229165 0.228050 0.230892
chargesum: 0.00000
title: Mulliken charges with hydrogens summed into heavy atoms:
elementType: P N N C C C C C C C C C C C C
charge: 0.625704 0.007802 -0.050002 -0.187748 -0.007548 -0.330349 0.254411 0.228728 -0.147033 -0.008785 -0.048849 -0.316743 -0.012575 -0.003971 -0.003042
polarizability: 2.28540163e+02 2.16310274e+00 1.76973689e+02 7.56416072e+00 -8.97853526e-01 8.77090663e+01
1716.lowfreq: -4.0333 -0.0014 -0.0013 -0.0008 6.1803 10.7188 23.3930 56.2757 69.9934
frequency: 22.5346 56.2585 69.9892 96.6301 115.0874 142.2834 202.1251 222.8993 259.1854 266.4846 287.0491 324.6970 362.6823 394.5612 410.5644 437.7568 458.6655 488.4922 527.0229 540.0982 579.8994 613.6351 621.8646 652.6714 672.1034 695.6536 700.3453 736.5132 750.8862 814.5143 847.4076 860.9929 910.9199 941.1304 970.6389 976.6402 986.7861 993.8689 1020.2709 1064.0534 1078.7901 1082.8863 1116.3535 1137.9810 1173.6641 1178.6019 1189.4511 1195.5935 1213.2776 1248.7178 1281.2342 1310.4153 1315.3475 1370.1565 1398.4490 1422.8299 1439.3182 1448.5133 1451.8237 1468.7353 1580.9129 1595.5151 1615.2899 1647.3435 2127.5793 2962.5847 2971.3204 3004.2107 3017.9020 3057.2094 3084.8857 3113.0869 3124.2616 3135.9885 3146.3413 3163.2188 3526.9489 3677.8925
redmass: 4.2390 4.5699 6.0383 4.2297 3.8307 5.3055 2.7604 5.0719 3.3072 4.7358 3.6628 4.5580 1.1358 2.8032 8.9592 3.2241 2.8588 3.4654 5.0322 1.3676 5.7029 6.2231 3.4196 4.3941 6.6594 5.0718 1.8672 5.0116 1.7453 1.5646 1.2797 1.7120 1.3721 1.9930 1.3989 1.7240 6.0466 1.3153 3.2507 2.0053 1.7475 2.4008 1.9250 1.2331 1.0578 1.3308 1.2218 1.1613 3.1659 1.4974 1.2215 1.3914 1.5498 5.8860 3.5905 2.1614 1.1199 1.0846 1.0986 1.9737 5.7405 5.8638 2.4738 1.6109 12.5780 1.0591 1.0631 1.0821 1.0760 1.0977 1.1050 1.0871 1.0856 1.0911 1.0958 1.1015 1.0469 1.1023
irintensity: 1.0600 0.6656 1.8983 3.5751 0.0981 2.7975 0.0979 2.0617 0.1815 0.2891 1.1692 3.0723 109.8306 0.2215 5.2559 2.1902 41.8480 24.3319 2.9587 103.7596 1.6581 0.1747 5.1399 18.7904 0.5226 2.3676 50.2933 4.1485 47.9587 5.5659 0.4726 6.7361 0.5539 7.9505 0.0185 1.7108 1.6330 0.0073 8.5234 3.5194 5.7008 1.1350 4.3458 2.5876 0.4126 17.5631 22.1113 4.4115 21.4087 10.3391 5.1762 6.8216 12.2041 0.3686 30.4678 10.7075 7.5096 17.9750 9.0859 20.9499 1.9832 14.5281 53.3096 251.5653 101.8513 46.6008 24.9981 3.3926 29.9070 6.6094 13.9102 6.8339 1.1069 9.4982 39.0089 29.8093 59.1681 34.1612
temp: 298.150 k
press: 1.00000 atm
elementType: 15 7 7 6 6 6 6 6 6 6 6 6 6 6 6 1 1 1 1 1 1 1 1 1 1 1 1 1
symmnumber: 1
zpe: 581208.6 jmol-1
zpe.correction: 0.221371 hartree
zpe.thermalcorrener: 0.235753 hartree
zpe.thermalcorrenthalpy: 0.236698 hartree
zpe.thermalcorrgfe: 0.179160 hartree
zpe.sumelectzpe: -914.717789 hartree
zpe.sumelectthermal: -914.703406 hartree
zpe.sumelectthermalent: -914.702462 hartree
zpe.sumelectthermalfe: -914.760000 hartree
dipole: -1.4534 -5.0433 -1.6338
dipole: 5.4970
quadrupole: -92.4224 -93.2650 -102.5260
quadrupole: -22.8232 -0.0393 1.2873
quadrupole: 3.6487 2.8062 -6.4549 -22.8232 -0.0393 1.2873
hfenergy: -914.9391596 hartree
pointgroup: C01 [X(C12H13N2P1)]
dipole: -0.6156983 1.9841316 0.6010955 debye
polarizability: 228.671406|-1.2224946|176.8296357|-6.9007626|-2.8183983|87.7218768 unknown
InChI: InChI=1S/C12H13N2P/c13-8-10-9-15(7-6-12(10)14)11-4-2-1-3-5-11/h1-5H,6-7,9,14H2
charge 0 multiplicity 1
28 atoms
P  -0.176162 0.501966 -1.009757
N  4.094962 1.19529 0.330705
N  4.156553 -2.307919 0.048275
C  0.335001 1.814896 0.29485
C  1.839698 2.111146 0.146923
C  0.870728 -0.871854 -0.187074
C  2.753149 0.88934 0.162963
C  2.319405 -0.424642 -0.003273
C  -1.901812 0.075198 -0.366486
C  -2.282129 -1.246877 -0.020032
C  -2.884383 1.100332 -0.320573
C  3.308118 -1.456369 0.023888
C  -3.608338 -1.533639 0.379425
C  -4.206913 0.81602 0.085674
C  -4.574312 -0.503911 0.438507
H  0.097028 1.427359 1.301918
H  -0.248885 2.736694 0.131396
H  2.155842 2.792131 0.963921
H  2.018021 2.655627 -0.802955
H  0.845975 -1.767464 -0.832018
H  0.410307 -1.143544 0.783953
H  -1.552923 -2.063688 -0.061492
H  -2.623084 2.126244 -0.609744
H  4.395811 2.156541 0.465544
H  4.802167 0.46046 0.316108
H  -3.88393 -2.561083 0.643287
H  -4.949647 1.621178 0.12073
H  -5.600946 -0.726633 0.749735
