program: Gaussian 09
title: 000290173
version: EM64L-G09RevD.01
frameworkgroup: C1[X(C14H18NO2PS)]
method: RPBEPBE
basis: SDD
operation: Freq
keyword: #p
keyword: freq=noraman
keyword: PBEPBE/SDD
title: #p freq=noraman PBEPBE/SDD
converged: YES YES NO NO
title: Mulliken charges:
elementType: S P O O N C C C C C C C C C C C C C C H H H H H H H H H H H H H H H H H H
charge: -0.230247 0.286172 -0.271477 -0.308105 0.011252 0.339079 -0.155214 -0.676367 -0.630394 -0.472726 0.073656 -0.176389 -0.296117 -0.347103 -0.547243 -0.530748 -0.238668 -0.213581 -0.225230 0.287968 0.290753 0.296981 0.298655 0.253015 0.247976 0.290583 0.244062 0.292535 0.241672 0.229704 0.236500 0.214178 0.246188 0.234128 0.233322 0.236787 0.234443
chargesum: 0.00000
title: Mulliken charges with hydrogens summed into heavy atoms:
elementType: S P O O N C C C C C C C C C C C C C C
charge: -0.230247 0.286172 -0.271477 -0.308105 0.011252 0.339079 0.132754 -0.088633 -0.078723 0.065833 0.073656 -0.176389 -0.052055 -0.054569 0.160634 0.163747 -0.005346 0.023206 0.009213
polarizability: 2.42398123e+02 -1.06707717e+01 2.16481790e+02 -1.97471500e+00 9.92653976e+00 1.27849837e+02
1716.lowfreq: -13.9457 -6.3953 -0.0014 -0.0002 0.0013 2.2010 27.2363 45.9175 55.1032
frequency: 27.1463 45.9077 55.0978 82.0345 104.4491 106.5837 118.6406 123.1904 129.4296 137.5099 164.1272 195.0884 199.1830 216.4211 228.3336 254.0343 263.5856 284.0515 301.5157 326.1365 343.9633 389.1931 401.4331 410.8244 419.0356 475.4951 490.0326 511.3092 546.4983 591.0155 609.7057 624.3211 641.1162 664.4211 685.2685 706.1558 733.3978 767.0691 806.6184 847.4834 854.8811 865.6700 921.5586 942.1969 957.7514 985.7730 988.5093 992.4665 1004.6557 1007.9140 1019.3412 1034.7224 1053.4637 1069.8632 1079.1290 1085.3650 1111.5346 1117.6672 1119.8728 1149.4374 1154.5698 1174.6200 1177.4370 1191.2961 1212.9898 1230.4095 1262.1077 1278.7073 1300.4850 1309.7701 1315.5164 1346.6476 1380.0054 1413.2511 1418.6721 1423.4886 1425.7836 1427.7255 1455.2426 1465.4068 1466.1008 1470.4972 1480.5709 1486.9570 1586.5813 1594.8350 2200.7113 2964.9434 2969.8868 2991.7005 3013.3937 3027.4537 3039.8334 3060.2720 3065.0613 3070.4345 3105.2764 3111.4853 3115.0949 3117.0693 3117.7780 3118.3843 3134.2353 3148.6683 3165.4382
redmass: 5.1827 4.1707 6.0949 5.9757 4.4485 6.7092 1.7782 4.1456 1.8565 5.6919 2.1997 1.4038 3.2506 4.8542 3.3081 3.7794 2.9218 2.8062 3.8580 3.8080 4.4470 5.2228 2.8849 5.7184 6.1701 3.9841 3.6691 7.8653 4.6227 4.9225 6.3863 3.8273 6.0840 3.7809 6.6000 2.0318 2.7957 1.7437 2.1782 3.2466 2.4374 1.2465 3.8857 1.3759 2.7928 5.8995 1.4127 4.3870 2.8510 1.3321 3.1582 2.1837 3.2060 2.3311 1.8476 2.2429 1.3620 1.2727 1.8603 1.4053 1.3563 1.0637 1.2908 1.1265 1.1227 1.4301 2.0690 1.3406 1.4223 1.3155 1.2990 1.6064 8.0527 1.0867 1.1189 1.1373 1.8868 1.1600 1.0611 1.7839 1.1421 1.0640 1.0516 1.0515 5.9708 5.8574 12.5730 1.0341 1.0316 1.0805 1.0608 1.0597 1.0578 1.0996 1.1043 1.1012 1.1036 1.0887 1.1023 1.1052 1.1008 1.0898 1.0891 1.0949 1.1011
irintensity: 0.3124 0.2663 0.2682 0.8762 1.2845 0.7391 2.7607 6.7186 0.7552 5.2143 3.5977 2.8339 10.6078 1.2594 10.5080 5.1416 1.2766 3.1159 1.3718 12.4435 5.4399 10.3269 0.4912 8.2644 4.1213 7.2355 8.8569 27.1635 1.0097 2.4704 1.7053 3.5650 22.2618 14.1552 5.0332 43.1711 35.6748 29.9850 10.0616 23.8300 68.3536 0.9172 4.6682 1.1699 13.3724 0.3063 2.1171 104.3377 79.0891 0.7571 5.6866 23.5825 124.7119 19.1397 23.7647 13.6186 3.0432 1.9328 6.3130 11.1525 6.6028 0.5771 26.2626 5.9175 1.0330 12.4249 1.9555 5.7173 6.6246 1.3451 14.1658 15.3275 1.9276 11.2888 10.8117 13.7783 19.7000 4.3623 11.6374 19.8516 10.2569 11.7173 14.5727 7.4847 0.3492 1.5370 3.4451 56.9069 38.9467 5.1271 13.3413 8.8594 4.5170 37.8895 36.0586 8.2668 4.0311 5.2216 15.9680 1.3902 19.5821 4.2282 1.2144 22.5651 37.9360
temp: 298.150 k
press: 1.00000 atm
elementType: 16 15 8 8 7 6 6 6 6 6 6 6 6 6 6 6 6 6 6 1 1 1 1 1 1 1 1 1 1 1 1 1 1 1 1 1 1
symmnumber: 1
zpe: 767855.4 jmol-1
zpe.correction: 0.292461 hartree
zpe.thermalcorrener: 0.312533 hartree
zpe.thermalcorrenthalpy: 0.313477 hartree
zpe.thermalcorrgfe: 0.243660 hartree
zpe.sumelectzpe: -1487.314013 hartree
zpe.sumelectthermal: -1487.293940 hartree
zpe.sumelectthermalent: -1487.292996 hartree
zpe.sumelectthermalfe: -1487.362813 hartree
dipole: 0.8569 -9.0286 -0.9020
dipole: 9.1139
quadrupole: -114.8223 -141.7646 -125.7601
quadrupole: 9.9248 0.1276 -1.1544
quadrupole: 12.6267 -14.3156 1.6889 9.9248 0.1276 -1.1544
hfenergy: -1487.6064732 hartree
pointgroup: C01 [X(C14H18N1O2P1S1)]
dipole: -0.6346472 -3.4925008 0.5068824 debye
polarizability: 244.0358026|8.5377367|213.8245735|-1.0567293|-13.5948983|128.8693745 unknown
InChI: InChI=1S/C14H18NO2PS/c1-16-14(17-2)8-9-18(19,11-12(14)10-15)13-6-4-3-5-7-13/h3-7,12H,8-9,11H2,1-2H3
charge 0 multiplicity 1
37 atoms
S  -0.635132 2.98117 -0.786209
P  -0.657512 0.946832 -0.266059
O  3.658094 -0.688484 -0.289658
O  1.65275 -1.85987 0.367001
N  3.140214 2.713654 0.880017
C  2.22414 -0.578734 -0.09025
C  1.847618 0.389336 1.087272
C  0.313403 0.513489 1.301963
C  0.145275 -0.178616 -1.55475
C  1.681474 -0.123658 -1.460897
C  -2.372762 0.250072 0.036555
C  2.533406 1.689069 0.940397
C  -2.556122 -1.109878 0.388564
C  -3.482436 1.111806 -0.1014
C  4.464949 -1.023603 0.899607
C  1.912284 -3.003092 -0.525383
C  -3.862351 -1.605333 0.60143
C  -4.786924 0.611095 0.112913
C  -4.978034 -0.745604 0.463633
H  2.250336 -0.076888 2.009212
H  -0.062448 -0.457554 1.662599
H  0.085381 1.294765 2.04498
H  -0.200983 0.181233 -2.537351
H  -0.238236 -1.200792 -1.392986
H  2.129941 -0.766099 -2.240026
H  2.039891 0.903872 -1.653204
H  -1.696625 -1.784352 0.498343
H  -3.304627 2.159698 -0.375092
H  5.444018 -1.330637 0.501751
H  4.010512 -1.855557 1.469761
H  4.601438 -0.139615 1.550166
H  1.282762 -2.960211 -1.435748
H  2.976768 -3.039317 -0.818829
H  1.648588 -3.896599 0.061361
H  -4.009138 -2.656286 0.873899
H  -5.64933 1.278011 0.006383
H  -5.989783 -1.132323 0.629535
