program: Gaussian 09
title: 000290171
version: EM64L-G09RevD.01
frameworkgroup: C1[X(C13H15N4P)]
method: RPBEPBE
basis: SDD
operation: Freq
keyword: #p
keyword: freq=noraman
keyword: PBEPBE/SDD
title: #p freq=noraman PBEPBE/SDD
converged: YES YES NO NO
title: Mulliken charges:
elementType: P N N N N C C C C C C C C C C C C C H H H H H H H H H H H H H H H
charge: 0.616312 -0.095864 -0.115832 -0.647172 -0.596618 -0.741785 -0.878398 -0.470067 0.177212 0.094591 -0.167699 0.137298 -0.282333 -0.249460 -0.064479 -0.226341 -0.243834 -0.232725 0.248620 0.260886 0.230364 0.278193 0.248534 0.249325 0.239385 0.244416 0.328696 0.327065 0.227968 0.226938 0.229651 0.324744 0.322408
chargesum: 0.00000
title: Mulliken charges with hydrogens summed into heavy atoms:
elementType: P N N N N C C C C C C C C C C C C C
charge: 0.616312 -0.095864 -0.115832 0.008589 0.050534 -0.232279 -0.369840 0.027792 0.177212 0.094591 -0.167699 0.137298 -0.042948 -0.005044 -0.064479 0.001627 -0.016895 -0.003075
polarizability: 2.83479538e+02 1.91750142e+01 1.81522939e+02 7.96930034e+00 -1.06842010e+01 1.17425749e+02
1716.lowfreq: -16.7232 -5.7944 0.0008 0.0010 0.0013 2.2717 9.2857 26.9842 52.0345
frequency: 8.3125 26.9234 51.9443 94.3067 110.4761 178.5084 194.6635 203.2018 213.7212 236.9824 273.2519 293.6618 307.6539 321.8265 376.2744 392.1597 396.1896 425.5415 440.8692 471.2948 492.8977 516.8800 526.7386 532.6628 556.6232 588.7039 605.5436 614.0533 666.1489 676.0640 696.5585 702.6399 715.9537 753.5793 761.7486 776.6239 832.7291 853.4508 868.4461 906.8751 918.5991 963.4430 975.2767 986.8418 995.4938 1000.1581 1015.6778 1020.4761 1076.8039 1082.2346 1083.0335 1124.8662 1131.6822 1166.4277 1171.2072 1173.2541 1190.3481 1194.7975 1240.4054 1270.0151 1292.8636 1310.2497 1330.8136 1369.8023 1386.3495 1421.3497 1428.9559 1439.5756 1444.7767 1454.9836 1468.2160 1474.8389 1527.5174 1560.3201 1580.4637 1594.5064 1600.2776 1617.5781 2957.8387 2987.2244 2991.8854 3016.5462 3047.3248 3071.7700 3112.9362 3123.3710 3136.4866 3147.6848 3162.2678 3556.3155 3566.1309 3711.8350 3726.9032
redmass: 3.8206 4.8966 5.2434 3.0996 4.3300 4.3492 4.6969 4.4156 5.7303 2.5119 3.8902 3.2115 3.5897 3.1469 1.2224 5.4490 2.8600 1.2089 4.6393 3.5870 3.5844 1.1885 3.9029 1.2144 2.5270 4.6752 5.1866 6.2547 4.3898 5.9866 5.5301 2.0391 4.7009 2.0724 3.3240 6.8402 1.7669 1.2608 1.9599 2.9448 1.3942 1.7586 1.4003 5.8203 1.3186 2.4711 2.4842 3.0365 1.6708 2.2707 2.3235 2.1050 1.2210 1.1366 1.5480 1.1336 1.6767 1.2412 1.7933 1.4137 2.7127 1.3735 1.9257 6.0199 4.2016 2.1203 1.6713 1.2621 1.0949 1.7395 1.9821 3.1756 4.8541 4.1514 5.7427 5.8376 1.5108 1.4928 1.0571 1.0639 1.0595 1.1026 1.0963 1.1035 1.0872 1.0859 1.0913 1.0951 1.1014 1.0449 1.0438 1.1039 1.1059
irintensity: 0.1651 0.0640 0.1663 0.3469 0.1528 5.7575 1.2508 8.7270 2.4792 1.3180 2.1173 2.7605 3.1538 7.7779 151.6046 15.1920 1.1536 298.3402 7.5513 9.7638 2.8061 28.2641 7.0600 41.6521 36.0608 8.7979 2.6638 0.6373 1.8619 0.1004 0.9192 44.5231 20.7657 38.5441 11.0439 22.3716 15.4231 0.1393 7.2626 1.9353 1.0532 0.5847 0.1748 2.7514 0.0167 5.6238 9.3930 7.9496 6.3903 2.4743 1.0835 5.8807 0.5083 8.0215 10.7307 1.3903 2.6273 0.7756 1.7787 4.2872 16.2387 4.3058 1.0982 0.5102 1.4618 10.9644 40.4854 44.2870 16.5173 190.6226 13.5361 36.2802 285.2071 184.9838 0.8861 13.6539 636.1325 297.1228 22.2807 16.1911 23.2248 12.3109 13.5236 18.3472 4.7855 0.3599 12.9826 36.7779 33.0663 64.6394 114.4238 36.8918 42.2656
temp: 298.150 k
press: 1.00000 atm
elementType: 15 7 7 7 7 6 6 6 6 6 6 6 6 6 6 6 6 6 1 1 1 1 1 1 1 1 1 1 1 1 1 1 1
symmnumber: 1
zpe: 688233.7 jmol-1
zpe.correction: 0.262134 hartree
zpe.thermalcorrener: 0.278563 hartree
zpe.thermalcorrenthalpy: 0.279507 hartree
zpe.thermalcorrgfe: 0.216415 hartree
zpe.sumelectzpe: -1063.359763 hartree
zpe.sumelectthermal: -1063.343335 hartree
zpe.sumelectthermalent: -1063.342390 hartree
zpe.sumelectthermalfe: -1063.405483 hartree
dipole: 0.8574 1.8067 1.4482
dipole: 2.4691
quadrupole: -99.0205 -100.6697 -117.2775
quadrupole: 1.4075 2.4005 -3.2993
quadrupole: 6.6354 4.9862 -11.6216 1.4075 2.4005 -3.2993
hfenergy: -1063.6218974 hartree
pointgroup: C01 [X(C13H15N4P1)]
dipole: 0.331577 0.66391 0.6268489 debye
polarizability: 282.7854356|20.7743334|183.9130938|6.9630165|-4.7756823|115.7296969 unknown
InChI: InChI=1S/C13H15N4P/c14-12-10-8-18(9-4-2-1-3-5-9)7-6-11(10)16-13(15)17-12/h1-5H,6-8,14-15H2
charge 0 multiplicity 1
33 atoms
P  1.046968 -0.44025 -1.180258
N  -3.272082 -1.281642 -0.068913
N  -3.797098 1.056277 0.400873
N  -2.140867 2.677488 0.528613
N  -5.476568 -0.569074 0.275381
C  0.451249 -1.954395 -0.18762
C  -0.010467 0.800229 -0.14785
C  -1.049543 -2.153325 -0.47929
C  -1.464243 0.371635 -0.024083
C  -1.94196 -0.954615 -0.176712
C  2.742088 -0.084463 -0.417252
C  -2.468414 1.354648 0.297621
C  3.45724 1.036849 -0.917269
C  3.351156 -0.890174 0.578449
C  -4.136535 -0.254126 0.195679
C  4.737455 1.361842 -0.415941
C  4.639317 -0.574732 1.071055
C  5.334003 0.554496 0.581093
H  0.613551 -1.78803 0.894261
H  1.02458 -2.845758 -0.49728
H  0.066027 1.776034 -0.666886
H  0.470944 0.910007 0.845292
H  -1.444703 -3.003318 0.106445
H  -1.197528 -2.425846 -1.543361
H  3.016442 1.650796 -1.713077
H  2.831892 -1.769342 0.974728
H  -1.179555 3.001763 0.53984
H  -2.899742 3.317706 0.751578
H  5.271947 2.233513 -0.810525
H  5.097917 -1.21056 1.837226
H  6.331029 0.798305 0.964883
H  -5.762202 -1.533084 0.131606
H  -6.1492 0.164646 0.476592
