program: Gaussian 09
title: 000290165
version: EM64L-G09RevD.01
frameworkgroup: C1[X(C9H9NOS)]
method: RPBEPBE
basis: SDD
operation: Freq
keyword: #p
keyword: freq=noraman
keyword: PBEPBE/SDD
title: #p freq=noraman PBEPBE/SDD
converged: YES YES NO NO
title: Mulliken charges:
elementType: S O N C C C C C C C C C H H H H H H H H H
charge: 0.182529 -0.237820 -0.331893 -0.613604 0.570455 -0.738668 0.227568 -0.433656 -0.347376 -0.217275 -0.218019 -0.235623 0.293759 0.335616 0.287945 0.290993 0.234259 0.254832 0.231426 0.231040 0.233512
chargesum: 0.00000
title: Mulliken charges with hydrogens summed into heavy atoms:
elementType: S O N C C C C C C C C C
charge: 0.182529 -0.237820 0.003723 -0.319844 0.570455 -0.159730 0.227568 -0.199397 -0.092544 0.014151 0.013021 -0.002112
polarizability: 1.72774700e+02 -4.28515019e+00 9.81155695e+01 7.12346116e+00 -1.13684602e+01 8.74400406e+01
1716.lowfreq: -11.5193 -5.5251 -0.0019 -0.0018 -0.0012 11.4297 35.3360 46.7973 80.7032
frequency: 35.2321 46.7065 80.6884 107.8796 210.2264 254.3305 291.0115 403.4585 423.0305 457.5768 484.5697 511.3082 594.1954 600.1639 612.9582 644.8037 703.0559 715.0920 744.3006 776.6516 831.3296 850.9719 853.7112 905.5573 928.8577 979.5510 990.0622 999.7259 1024.4031 1071.6885 1101.6665 1122.4411 1160.6768 1173.9050 1185.2428 1213.0467 1229.0592 1284.6438 1315.3367 1349.8877 1386.8978 1393.9518 1438.2705 1445.7570 1482.2878 1596.1538 1612.0922 1644.7060 3008.7562 3042.0984 3116.2249 3119.1027 3129.9177 3141.2584 3152.8543 3167.7030 3546.0727
redmass: 4.7097 3.5357 4.6145 6.5063 5.1260 5.0726 6.5079 2.7992 7.2696 10.4284 3.0593 2.1243 5.6746 4.0896 6.3232 1.7376 1.6952 5.3342 5.7579 1.9755 4.9515 3.6082 1.2791 1.5758 1.4398 1.3921 6.1799 1.3259 2.2073 1.9878 2.2597 1.1657 1.3398 1.0577 1.1130 2.1855 1.3338 1.7621 2.0504 1.4346 2.1854 3.7614 1.1052 2.0591 2.3060 6.0509 6.0686 7.8474 1.0865 1.0576 1.1061 1.0879 1.0862 1.0911 1.0962 1.1015 1.0772
irintensity: 0.1444 0.4532 2.2052 4.9951 0.5748 1.1347 1.1350 0.3006 19.8034 2.6513 13.3205 17.3711 10.2320 19.3086 0.2322 107.8257 52.6108 16.0457 8.0618 40.0809 6.5148 5.2817 1.0958 9.0928 3.0489 0.1637 0.7947 0.1318 6.2887 16.9903 17.2507 0.1979 11.6698 0.4177 4.7919 7.4474 49.0921 74.1691 51.5949 5.7406 51.8110 9.3778 5.7382 15.8134 7.6269 0.3991 0.3078 447.2329 24.6803 15.8314 2.0567 7.4334 0.0848 12.2441 30.8406 20.6089 30.0383
temp: 298.150 k
press: 1.00000 atm
elementType: 16 8 7 6 6 6 6 6 6 6 6 6 1 1 1 1 1 1 1 1 1
symmnumber: 1
zpe: 422838.7 jmol-1
zpe.correction: 0.161051 hartree
zpe.thermalcorrener: 0.171540 hartree
zpe.thermalcorrenthalpy: 0.172484 hartree
zpe.thermalcorrgfe: 0.123098 hartree
zpe.sumelectzpe: -875.542891 hartree
zpe.sumelectthermal: -875.532401 hartree
zpe.sumelectthermalent: -875.531457 hartree
zpe.sumelectthermalfe: -875.580843 hartree
dipole: 3.2340 -0.9289 0.8427
dipole: 3.4687
quadrupole: -79.0938 -82.7610 -73.6116
quadrupole: 9.4396 2.7294 -5.2400
quadrupole: -0.6050 -4.2722 4.8772 9.4396 2.7294 -5.2400
hfenergy: -875.7039414 hartree
pointgroup: C01 [X(C9H9N1O1S1)]
dipole: -1.2851789 0.3898552 0.2423558 debye
dipolederiv: -0.287533 -0.100418 0.0995741 -0.0313194 -0.1530816 0.0045356 0.0680016 0.0086134 -0.1428205 -1.0158691 0.2627508 -0.0529569 0.614396 -0.7048757 0.1745087 -0.2671589 0.2378569 -0.5134016 -1.3909501 0.2156 0.011339 0.0218095 -0.4478202 0.0039743 0.240419 -0.0873909 -0.4500732 0.8451621 0.0604479 -0.0457601 -0.0332817 0.4795227 -0.0666522 0.1167865 -0.093139 0.4622696 0.0397792 0.0287365 -0.0547102 0.0379329 -0.0735741 -0.006053 -0.050203 0.0080403 -0.0867563 0.2445318 -0.0832705 0.0853499 -0.1006387 -0.0540567 0.227654 0.074022 0.2669582 -0.1795674 1.6077246 -0.453859 -0.1245583 -0.6297736 0.6866756 -0.3286194 -0.1661099 -0.3209499 0.618902 -0.0890964 0.0468089 0.0351454 -0.039112 0.0319344 0.1126851 -0.0273708 0.083471 -0.0997743 -0.0504369 -0.0726141 -0.0412312 -0.0373962 -0.0631024 0.0386841 -0.05205 0.038897 -0.0942019 0.0366985 -0.0947165 -0.0579429 -0.1193116 -0.0429998 0.0627119 -0.0818511 0.0521592 -0.0981205 -0.0728063 0.0407598 0.0302284 0.0444712 0.0788562 0.1152167 0.0259945 0.127427 -0.0760031 0.0582611 0.0446244 0.0221502 0.0544194 -0.0559442 0.0548336 0.0213549 0.0513658 -0.1292143 -0.0397475 0.0396793 0.0425919 0.0490274 -0.0755087 -0.0437757 0.0205657 -0.0483125 -0.0971361 0.2293624 0.0582396 0.0349799 0.078926 0.2087986 0.0744287 0.080861 0.087829 0.2188871 -0.1080321 -0.0443388 -0.0371854 -0.01062 0.0308504 0.0012213 -0.0783157 -0.0210734 0.0877125 -0.0075655 0.0487581 0.0211466 0.0881283 0.0509188 -0.071717 0.0122782 -0.0385153 0.0235654 0.0938356 -0.059978 -0.0384352 -0.0397317 -0.041265 -0.0993631 -0.0165589 -0.0965572 0.0905352 0.0059645 0.0782803 0.0469855 0.081084 0.069585 -0.0423283 0.0688449 -0.0424112 0.108776 -0.0574291 0.0796923 0.0562398 0.0913204 0.0436675 -0.0681205 0.0589563 -0.067128 0.1191513 0.0644657 -0.0297967 -0.0115445 -0.0496764 -0.0523892 -0.1066239 -0.0262019 -0.1103828 0.0958809 -0.1063194 -0.0653862 -0.0214058 -0.0706538 0.0838084 -0.0372011 -0.0222644 -0.0367579 0.1413891 unknown
polarizability: 172.7438607|-2.7989347|103.4034002|-8.7010432|5.7609145|82.1830491 unknown
InChI: InChI=1S/C9H9NOS/c11-8-6-12-9(10-8)7-4-2-1-3-5-7/h1-5,9-10H,6H2
charge 0 multiplicity 1
21 atoms
S  1.357561 1.421578 -1.281462
O  3.649163 -1.224314 0.653466
N  1.527423 -0.243629 0.829621
C  0.580179 0.777894 0.379407
C  -0.829996 0.264338 0.173994
C  2.995874 0.560787 -0.921165
C  2.781458 -0.399295 0.258134
C  -1.926123 1.030479 0.640184
C  -1.072637 -0.967486 -0.486154
C  -3.250743 0.57543 0.448857
C  -2.393519 -1.4261 -0.669423
C  -3.486864 -0.65506 -0.204406
H  0.573082 1.643539 1.066744
H  1.275527 -0.841034 1.620511
H  3.775371 1.29454 -0.658824
H  3.317099 -0.013442 -1.803364
H  -1.743624 1.983655 1.152454
H  -0.224891 -1.554095 -0.857608
H  -4.092483 1.175751 0.810954
H  -2.574993 -2.379095 -1.17862
H  -4.512364 -1.011641 -0.3513
