program: Gaussian 09
title: 000003656
version: EM64L-G09RevD.01
frameworkgroup: C1[X(C12H18N2O4S)]
method: RPBEPBE
basis: SDD
operation: Freq
keyword: #p
keyword: freq=noraman
keyword: PBEPBE/SDD
title: #p freq=noraman PBEPBE/SDD
converged: YES YES NO NO
title: Mulliken charges:
elementType: S O O O O N N C C C C C C C C C C C C H H H H H H H H H H H H H H H H H H
charge: 1.001841 -0.485751 -0.549451 -0.302717 -0.476998 -0.381728 -0.677828 -0.325285 -0.388843 -0.352445 -0.055313 -0.683976 0.399829 -0.254260 -0.181079 0.401553 -0.362138 -0.374814 -0.416354 0.215005 0.195443 0.211026 0.262183 0.193270 0.191052 0.293886 0.336336 0.289979 0.306430 0.214316 0.217128 0.210471 0.298702 0.240817 0.214592 0.215227 0.359894
chargesum: 0.00000
title: Mulliken charges with hydrogens summed into heavy atoms:
elementType: S O O O O N N C C C C C C C C C C C C
charge: 1.001841 -0.485751 -0.549451 -0.302717 -0.117104 -0.087842 -0.341491 0.085162 0.084366 0.031877 -0.055313 -0.042060 0.399829 0.035719 0.125351 0.401553 -0.063437 -0.133997 0.013465
polarizability: 2.14132889e+02 -2.55870291e+01 1.77126097e+02 -3.28702970e+00 -1.06071838e+01 1.66365095e+02
1716.lowfreq: -8.9687 -4.5063 -3.2028 -0.6327 -0.0016 -0.0007 0.0012 19.1428 37.5258
frequency: -7.0568 19.0377 37.5127 46.6621 55.3663 65.4677 73.6216 87.4450 112.5058 117.4928 123.7707 161.6892 194.8659 212.6736 225.4334 233.5713 240.0950 243.5020 265.4117 281.2507 293.7765 314.2778 350.7390 366.7386 402.1122 406.3608 431.7236 471.3143 489.3712 510.9004 521.4715 604.4399 617.8724 653.2726 692.3972 703.9565 710.7232 741.7075 774.6428 811.5149 816.2736 822.7223 848.0319 857.4761 913.3652 947.3866 957.1201 974.1591 990.6064 991.4719 996.3579 997.3516 1021.6843 1049.6708 1051.3216 1102.2455 1116.1091 1118.7574 1135.5665 1142.9575 1175.6240 1186.3789 1205.8383 1225.7846 1227.9381 1260.0489 1288.4092 1298.3997 1308.3355 1325.8276 1351.5631 1366.1809 1377.8159 1391.3388 1391.5759 1414.3981 1453.7386 1456.6855 1466.6295 1472.7037 1473.4061 1478.5000 1483.7460 1486.6467 1595.2454 1599.3729 1616.4298 2928.1391 2959.1549 2971.8098 2975.4047 2978.2865 2990.3148 3004.2262 3044.6017 3072.2443 3075.5202 3079.7967 3131.2828 3158.5054 3186.2442 3188.7764 3493.2410 3562.9274 3594.1081
redmass: 3.8294 4.5726 4.3720 4.2189 4.4266 2.5759 2.8542 3.1595 5.3599 4.6130 5.7681 3.8932 7.6149 5.6223 5.0057 1.5282 1.1811 2.7932 5.7230 1.8907 2.8860 1.7858 7.4324 2.8388 6.5913 3.0898 4.7996 5.3403 1.6849 2.6929 2.0592 5.1245 7.0559 4.5519 4.3777 3.6344 4.8366 1.2757 4.5537 2.0504 2.4621 2.1628 1.8919 1.2594 1.7112 1.3562 7.8568 1.8547 3.2281 1.7421 2.9676 5.9880 1.7145 2.3614 2.8063 2.6441 1.3961 1.9351 1.8686 1.3957 1.7996 1.1470 1.0648 1.7449 1.3249 1.2931 1.1043 1.2506 1.2738 1.6847 1.5460 1.3772 2.4438 4.2174 1.2157 2.0586 1.1295 1.0837 1.1669 1.0920 1.9966 1.0455 1.5857 1.1140 6.5690 6.6600 6.8247 1.0549 1.0587 1.1050 1.0370 1.0595 1.0673 1.0982 1.1011 1.1005 1.0996 1.0984 1.0906 1.0903 1.0946 1.0951 1.0787 1.0775 1.0667
irintensity: 0.1891 0.4567 1.0945 9.6548 6.1309 3.5336 2.7339 7.9059 0.7169 1.4442 4.3703 13.9874 3.5334 7.0652 7.1413 44.7054 102.9449 19.3242 12.8835 4.0865 13.8167 5.7557 12.0578 24.9244 23.9115 3.0625 43.1361 18.6222 132.2145 60.5782 125.1566 14.7241 1.0241 63.9754 101.1906 12.8333 18.9619 52.2785 16.4805 110.8849 20.4084 29.3179 8.1577 20.1980 2.9386 0.3415 91.8552 5.9663 14.8380 4.4136 49.0905 49.4985 3.2140 24.0809 11.6639 27.5031 8.1232 4.7997 5.3701 54.4803 123.3341 6.4521 0.0824 8.4876 14.0044 26.4050 0.3339 0.2748 1.9299 317.9503 5.1911 20.8284 9.6619 18.7989 9.0048 13.4387 55.9876 6.4990 26.7531 24.6215 12.8984 5.2624 316.5205 50.1692 6.3997 6.5628 151.4317 45.5624 28.7212 41.6558 26.1095 50.2030 44.0626 4.6755 54.5599 77.9747 45.3409 8.8835 11.8504 3.3431 5.9142 1.1943 26.5261 23.9725 8.4971
temp: 298.150 k
press: 1.00000 atm
elementType: 16 8 8 8 8 7 7 6 6 6 6 6 6 6 6 6 6 6 6 1 1 1 1 1 1 1 1 1 1 1 1 1 1 1 1 1 1
symmnumber: 1
zpe: 761366.1 jmol-1
zpe.correction: 0.289989 hartree
zpe.thermalcorrener: 0.310790 hartree
zpe.thermalcorrenthalpy: 0.311734 hartree
zpe.thermalcorrgfe: 0.238521 hartree
zpe.sumelectzpe: -1274.904592 hartree
zpe.sumelectthermal: -1274.883791 hartree
zpe.sumelectthermalent: -1274.882847 hartree
zpe.sumelectthermalfe: -1274.956060 hartree
dipole: 1.3000 6.5609 0.3010
dipole: 6.6953
quadrupole: -85.2905 -128.8529 -122.8040
quadrupole: -21.8370 11.9864 -6.8895
quadrupole: 27.0253 -16.5371 -10.4882 -21.8370 11.9864 -6.8895
hfenergy: -1275.1945807 hartree
pointgroup: C01 [X(C12H18N2O4S1)]
dipole: -0.3641975 -2.6023481 -0.1836269 debye
polarizability: 216.9530017|-22.8123894|171.4767336|-2.3034516|12.4277004|169.1943463 unknown
InChI: InChI=1S/C12H18N2O4S/c1-2-3-8-13-12(16)14-19(17,18)11-6-4-10(9-15)5-7-11/h4-7,13-15H,2-3,8-9H2,1H3
charge 0 multiplicity 1
37 atoms
S  0.582619 2.230695 0.732397
O  0.478037 3.333618 -0.443401
O  0.901722 2.672304 2.266542
O  -1.229503 0.626283 -1.228221
O  5.308918 -2.635169 0.30427
N  -3.092125 0.541495 0.194385
N  -1.0424 1.383351 0.978881
C  -4.130827 -1.662674 -0.48612
C  -3.953625 -0.154806 -0.779899
C  -4.854317 -1.96325 0.846639
C  1.76798 0.857796 0.228999
C  -5.0508 -3.475784 1.087332
C  3.610128 -1.094473 -0.48037
C  2.555292 0.295492 1.244562
C  1.851364 0.501796 -1.126412
C  -1.768914 0.841067 -0.101373
C  3.488362 -0.698373 0.872628
C  2.792402 -0.490353 -1.470785
C  4.614064 -2.157682 -0.892626
H  -3.135978 -2.149233 -0.492316
H  -4.708939 -2.107612 -1.321912
H  -4.94129 0.346948 -0.795344
H  -3.482068 -0.012957 -1.767207
H  -5.841042 -1.455229 0.850309
H  -4.272927 -1.536008 1.689594
H  -3.468475 0.744544 1.120573
H  -1.451197 1.649814 1.882673
H  2.454344 0.636384 2.27984
H  1.195432 0.965644 -1.866884
H  -4.077488 -4.000722 1.110413
H  -5.563985 -3.670873 2.046627
H  -5.65682 -3.929166 0.280547
H  4.130633 -1.172386 1.618309
H  2.881621 -0.796105 -2.520122
H  4.078614 -2.989437 -1.400871
H  5.331106 -1.720031 -1.621613
H  5.981782 -3.314406 0.053556
