program: Gaussian 09
title: 000290163
version: EM64L-G09RevD.01
frameworkgroup: C1[X(C16H13NO2S)]
method: RPBEPBE
basis: SDD
operation: Freq
keyword: #p
keyword: freq=noraman
keyword: PBEPBE/SDD
title: #p freq=noraman PBEPBE/SDD
converged: YES YES NO NO
title: Mulliken charges:
elementType: S O O N C C C C C C C C C C C C C C C C H H H H H H H H H H H H H
charge: 0.260294 -0.188948 -0.143233 -0.283275 -0.625227 -0.545863 0.262120 0.483220 -0.118994 0.503988 -0.396065 -0.383097 -0.336708 -0.342826 -0.227586 -0.226950 -0.236449 -0.218561 -0.215029 -0.236690 0.331706 0.256846 0.241814 0.236312 0.241212 0.259286 0.261387 0.227798 0.229223 0.231145 0.232429 0.233049 0.233670
chargesum: 0.00000
title: Mulliken charges with hydrogens summed into heavy atoms:
elementType: S O O N C C C C C C C C C C C C C C C C
charge: 0.260294 -0.188948 -0.143233 -0.283275 -0.293520 -0.047204 0.262120 0.483220 -0.118994 0.503988 -0.159754 -0.141885 -0.077422 -0.081438 0.000212 0.002273 -0.005304 0.013868 0.018021 -0.003020
polarizability: 2.99955224e+02 7.89093870e+00 1.73411011e+02 -1.19037888e+01 3.23354522e+00 1.23144889e+02
1716.lowfreq: -6.4047 -3.5086 0.0016 0.0019 0.0020 3.0852 21.2222 30.7620 38.5457
frequency: 21.2191 30.5974 38.5401 52.1822 72.9736 79.5857 91.7782 153.1274 181.4655 204.6464 268.8235 271.2551 312.1105 369.3633 379.9316 396.5285 403.6714 405.7021 449.0777 482.9086 501.2330 523.8948 560.9679 580.1548 610.5672 616.9504 617.5115 638.8192 692.1833 700.6221 705.7426 718.7275 761.4107 765.8723 798.0225 831.6290 838.9144 855.1276 915.3557 920.0688 937.8011 971.7991 973.4725 978.3602 990.1808 991.0793 996.1610 998.0199 1020.0177 1027.3202 1033.1703 1079.8625 1081.0575 1112.6015 1145.0132 1172.7120 1174.4327 1175.7811 1189.6929 1192.7936 1217.9605 1219.1780 1265.6590 1305.5464 1319.4403 1325.2961 1333.4094 1383.6639 1386.1014 1441.9762 1443.4585 1465.5268 1483.2883 1485.3315 1594.0971 1597.4822 1608.5542 1614.7821 1616.6688 1675.6441 2999.5648 3050.9282 3068.8654 3115.5520 3123.8305 3135.0088 3135.5855 3147.4988 3147.8023 3162.5151 3165.1123 3177.1057 3182.7911
redmass: 6.5305 4.5580 4.9034 4.2244 9.5521 5.4478 5.8556 8.2857 6.6768 5.4866 6.3544 7.0426 4.5063 2.4910 13.7650 5.0174 2.8204 2.8184 13.7790 3.7901 4.2325 5.2929 10.8449 4.7129 7.2341 7.4395 6.2978 6.8472 2.1878 3.9819 1.8738 3.4698 1.9850 2.1052 5.2316 4.1520 1.2613 1.2457 1.4688 1.4582 1.8612 1.4288 4.0805 1.4088 6.1228 6.0758 1.3254 1.3334 3.7729 2.2190 2.4579 2.0622 1.5682 3.4685 1.1358 2.9368 1.1037 1.0503 1.1218 1.1919 1.3282 2.4282 1.2516 5.7795 1.3828 1.3411 1.2680 7.5961 10.0151 2.1641 2.2798 1.1161 2.2940 2.2766 6.0430 6.7696 6.1590 6.1170 11.5604 12.8530 1.0596 1.0877 1.0990 1.0877 1.0866 1.0855 1.0911 1.0900 1.0959 1.0952 1.1015 1.0958 1.0991
irintensity: 0.4227 0.0247 0.3437 0.2936 0.8942 0.5331 1.4972 4.8916 1.0702 0.3948 6.0206 7.3849 3.0375 0.1131 2.0835 1.4642 0.0463 0.5804 5.6868 9.7212 3.9069 35.3265 4.0885 19.0202 3.3793 9.7262 0.3364 10.0393 30.6619 1.9171 58.0865 39.5045 29.1380 58.9050 50.6558 1.9690 0.8855 0.2592 2.9280 4.0273 4.8469 0.7374 9.2440 0.1030 0.6359 1.4150 0.5700 0.2895 4.9188 1.1289 11.1206 33.0545 9.1164 125.3563 16.4517 52.2210 2.7694 0.1238 0.6228 2.0131 18.7085 3.6626 19.7437 324.5089 1.4063 7.0018 1.3702 0.1074 1.7198 7.4879 12.9281 11.8855 72.8918 13.7701 6.0912 45.9698 12.6975 8.2891 370.4696 140.5382 9.1114 0.7227 8.2077 7.5357 4.6483 0.0012 12.6776 13.0372 35.5168 34.1649 22.5261 6.7562 1.7402
temp: 298.150 k
press: 1.00000 atm
elementType: 16 8 8 7 6 6 6 6 6 6 6 6 6 6 6 6 6 6 6 6 1 1 1 1 1 1 1 1 1 1 1 1 1
symmnumber: 1
zpe: 654691.2 jmol-1
zpe.correction: 0.249359 hartree
zpe.thermalcorrener: 0.266305 hartree
zpe.thermalcorrenthalpy: 0.267249 hartree
zpe.thermalcorrgfe: 0.201898 hartree
zpe.sumelectzpe: -1219.392604 hartree
zpe.sumelectthermal: -1219.375657 hartree
zpe.sumelectthermalent: -1219.374713 hartree
zpe.sumelectthermalfe: -1219.440064 hartree
dipole: 0.7662 -1.4338 -0.0023
dipole: 1.6257
quadrupole: -99.7682 -134.2095 -119.7692
quadrupole: 3.7296 -1.4554 -3.1780
quadrupole: 18.1474 -16.2938 -1.8535 3.7296 -1.4554 -3.1780
hfenergy: -1219.6419623 hartree
pointgroup: C01 [X(C16H13N1O2S1)]
dipole: 0.3066191 -0.5602746 0.0339185 debye
polarizability: 299.6621988|8.2124463|173.7532625|-13.4697852|-0.2169256|123.0956626 unknown
InChI: InChI=1S/C16H13NO2S/c18-15-14(11-12-7-3-1-4-8-12)20-16(19)17(15)13-9-5-2-6-10-13/h1-10,14H,11H2
charge 0 multiplicity 1
33 atoms
S  0.783372 1.694452 -0.351205
O  -0.812933 -1.959207 -0.38238
O  -1.755695 2.645235 0.068294
N  -1.520015 0.286437 -0.140028
C  0.876201 -0.195354 -0.460497
C  1.817722 -0.815602 0.609431
C  -0.553284 -0.732541 -0.331331
C  3.279613 -0.467056 0.373704
C  -1.050621 1.636939 -0.104018
C  -2.933411 -0.01201 0.019394
C  4.051208 -1.214021 -0.554101
C  3.890284 0.619053 1.050431
C  -3.334034 -1.024898 0.920881
C  -3.889956 0.709106 -0.731376
C  5.40155 -0.882691 -0.802065
C  5.241363 0.953753 0.804136
C  6.000772 0.204506 -0.123565
C  -4.706904 -1.317982 1.065496
C  -5.260501 0.413526 -0.570692
C  -5.673281 -0.600232 0.32413
H  1.247208 -0.447408 -1.468766
H  1.667494 -1.910739 0.552655
H  1.488135 -0.48207 1.610106
H  3.595456 -2.066003 -1.075092
H  3.304652 1.204394 1.76933
H  -2.586424 -1.583578 1.48957
H  -3.571023 1.495437 -1.420604
H  5.986474 -1.472341 -1.516828
H  5.700035 1.794595 1.336247
H  7.04883 0.46172 -0.313056
H  -5.019184 -2.105131 1.759862
H  -6.003355 0.974801 -1.147147
H  -6.737948 -0.828389 0.442782
