program: Gaussian 09
title: 000290160
version: EM64L-G09RevD.01
frameworkgroup: C1[X(C16H11NO2S)]
method: RPBEPBE
basis: SDD
operation: Freq
keyword: #p
keyword: freq=noraman
keyword: PBEPBE/SDD
title: #p freq=noraman PBEPBE/SDD
converged: YES YES NO NO
title: Mulliken charges:
elementType: S O O N C C C C C C C C C C C C C C C C H H H H H H H H H H H
charge: 0.165568 -0.201580 -0.136549 -0.324744 0.496504 -0.316330 0.258672 -0.090889 -0.186294 0.468859 -0.341468 -0.345153 -0.217303 -0.215439 -0.384956 -0.348245 -0.237800 -0.238075 -0.243331 -0.229842 0.261467 0.263459 0.260810 0.231984 0.232403 0.236810 0.243351 0.232891 0.234823 0.234080 0.236318
chargesum: 0.00000
title: Mulliken charges with hydrogens summed into heavy atoms:
elementType: S O O N C C C C C C C C C C C C C C C C
charge: 0.165568 -0.201580 -0.136549 -0.324744 0.496504 -0.316330 0.258672 -0.090889 0.075173 0.468859 -0.078010 -0.084343 0.014681 0.016964 -0.148145 -0.104894 -0.004909 -0.003253 -0.009250 0.006476
polarizability: 4.10971300e+02 -1.00775872e+01 1.93034024e+02 -1.75246396e+00 7.33585451e+00 9.40060594e+01
1716.lowfreq: -5.7736 -2.0791 -0.0017 -0.0015 -0.0013 3.0201 27.8234 32.8015 52.8562
frequency: 27.8223 32.7776 52.8551 60.6598 80.9975 107.4621 112.2279 165.1221 201.8340 251.0854 257.1036 273.1170 288.6343 377.7129 382.0438 400.1021 405.2586 437.9873 461.7527 502.8409 531.0290 536.1152 568.2008 606.2068 609.7614 613.6771 620.2278 658.8099 689.5545 691.9130 717.6814 730.3758 770.8825 776.0053 788.5646 838.3556 841.2607 869.4167 913.9501 917.9024 952.3575 971.1486 980.5677 987.0872 990.7630 995.0721 1001.7263 1018.6635 1027.2731 1035.5850 1080.0446 1095.8338 1116.6430 1155.1436 1175.4841 1177.0521 1192.1462 1201.2230 1246.7999 1301.4220 1310.0045 1324.8634 1347.4664 1385.9705 1389.5852 1439.2326 1443.1522 1483.0632 1484.9053 1577.0016 1589.6767 1601.0566 1608.5519 1610.7912 1628.7072 1680.4898 3090.9048 3126.9098 3134.5623 3135.4759 3147.2192 3147.8514 3159.0663 3162.2373 3171.4194 3176.6566 3184.5624
redmass: 6.0952 3.9668 4.6172 5.8745 10.4251 6.6478 6.8444 7.3177 6.7674 5.7034 5.2181 6.0234 8.2982 8.4233 8.8930 2.9625 2.8224 5.1892 14.8525 3.8178 2.8412 7.1643 12.5218 6.9948 7.2526 6.9826 8.8446 7.0108 1.6811 2.1192 4.4987 4.1634 2.5248 2.0223 4.5431 1.2562 1.2721 4.9528 1.3534 1.4277 1.5169 1.3961 1.4050 6.0684 6.0698 1.3256 1.3428 4.1279 2.2393 2.6924 2.0291 1.6907 3.7118 3.7097 1.0497 1.0661 1.1379 1.1236 2.7723 5.0054 1.8999 1.3123 1.2901 9.9052 5.4215 2.2878 2.2835 2.2671 2.2523 5.5581 8.7218 6.8529 6.0995 6.4516 8.5233 12.9119 1.0871 1.0870 1.0855 1.0872 1.0901 1.0917 1.0956 1.0953 1.1012 1.0968 1.0981
irintensity: 0.9007 0.2720 0.5145 0.7566 0.9022 0.1132 0.9661 1.9546 1.3493 1.8654 2.1682 5.6460 10.2036 1.9851 1.2966 0.0012 0.8696 0.5767 10.0688 4.7502 24.4936 63.0162 21.0570 5.9626 3.7130 19.5370 0.8175 14.8934 53.0992 38.8858 5.9077 44.6192 10.4966 69.8454 57.9048 0.2037 0.0063 2.5165 0.5289 2.5867 16.7381 0.0205 1.8056 2.0117 2.2737 0.2036 0.1905 9.6621 4.0050 2.6098 14.1471 14.2082 78.8701 292.3208 0.0415 2.4757 0.6616 5.8161 8.7979 471.9451 32.9239 5.0489 11.0607 1.4493 8.8031 22.2538 13.3438 109.0183 1.1876 1.8377 242.5162 54.2671 14.0373 31.5653 110.8612 396.2572 1.2244 3.7638 0.0146 0.2421 13.5886 15.2079 30.3807 37.9462 24.5970 6.7753 1.8888
temp: 298.150 k
press: 1.00000 atm
elementType: 16 8 8 7 6 6 6 6 6 6 6 6 6 6 6 6 6 6 6 6 1 1 1 1 1 1 1 1 1 1 1
symmnumber: 1
zpe: 594620.0 jmol-1
zpe.correction: 0.226479 hartree
zpe.thermalcorrener: 0.242931 hartree
zpe.thermalcorrenthalpy: 0.243875 hartree
zpe.thermalcorrgfe: 0.180417 hartree
zpe.sumelectzpe: -1218.209685 hartree
zpe.sumelectthermal: -1218.193233 hartree
zpe.sumelectthermalent: -1218.192289 hartree
zpe.sumelectthermalfe: -1218.255747 hartree
dipole: 2.3642 -1.3098 0.2147
dipole: 2.7113
quadrupole: -87.9054 -126.7879 -124.6814
quadrupole: 3.4198 -1.5181 5.3914
quadrupole: 25.2195 -13.6630 -11.5565 3.4198 -1.5181 5.3914
hfenergy: -1218.436164 hartree
pointgroup: C01[X(C16H11N1O2S1)]
dipole: 0.9263478 -0.5102285 -0.1393096 debye
polarizability: 410.5882097|-8.3407146|173.1844627|-11.4433971|40.5371017|114.2387104 unknown
InChI: InChI=1S/C16H11NO2S/c18-15-14(11-12-7-3-1-4-8-12)20-16(19)17(15)13-9-5-2-6-10-13/h1-11H
charge 0 multiplicity 1
31 atoms
S  0.676395 1.80357 0.529594
O  -0.7974 -1.728529 -0.494905
O  -1.923662 2.669387 0.829924
N  -1.602215 0.404336 0.165395
C  -3.00932 0.050889 0.098979
C  0.784803 0.061476 0.012764
C  -0.566908 -0.542681 -0.14438
C  -1.198807 1.704643 0.5368
C  1.906631 -0.69409 -0.219652
C  3.329303 -0.375219 -0.134096
C  -3.503646 -0.636484 -1.033421
C  -3.867542 0.396071 1.168334
C  -4.870519 -0.98367 -1.088016
C  -5.234307 0.052455 1.097253
C  4.252298 -1.424019 -0.436364
C  3.858391 0.901024 0.229436
C  -5.739502 -0.639626 -0.027304
C  5.642452 -1.21268 -0.37735
C  5.250194 1.109859 0.287537
C  6.148654 0.058108 -0.013927
H  1.667746 -1.725824 -0.521113
H  -2.83001 -0.907075 -1.8500
H  -3.476912 0.933164 2.036863
H  -5.254673 -1.520015 -1.962108
H  -5.901333 0.323431 1.922376
H  3.862141 -2.409806 -0.717413
H  3.190658 1.734433 0.467116
H  -6.800329 -0.907863 -0.076682
H  6.330386 -2.031703 -0.612488
H  5.638044 2.094968 0.568382
H  7.229792 0.227972 0.033564
