program: Gaussian 09
title: 000290158
version: EM64L-G09RevD.01
frameworkgroup: C1[X(C17H26N2O10)]
method: RPBEPBE
basis: SDD
operation: Freq
keyword: #p
keyword: freq=noraman
keyword: PBEPBE/SDD
title: #p freq=noraman PBEPBE/SDD
converged: YES YES NO NO
title: Mulliken charges:
elementType: O O O O O O O O O O N N C C C C C C C C C C C C C C C C C H H H H H H H H H H H H H H H H H H H H H H H H H H
charge: -0.223998 -0.258225 -0.301735 -0.261325 -0.262926 -0.330090 -0.235452 -0.236020 -0.236899 -0.243062 -0.439115 -0.153206 -0.081573 -0.167645 -0.162470 0.043324 -0.092094 -0.387412 0.313107 0.300155 0.319109 0.332563 -0.759892 -0.760832 0.309241 -0.760069 -0.632318 -0.663448 -0.761671 0.298516 0.302799 0.311309 0.249582 0.290329 0.253198 0.252144 0.365606 0.256457 0.248413 0.250952 0.258509 0.256535 0.241750 0.253417 0.247106 0.248111 0.221917 0.286683 0.224016 0.242328 0.243623 0.228838 0.241154 0.241414 0.279275
chargesum: 0.00000
title: Mulliken charges with hydrogens summed into heavy atoms:
elementType: O O O O O O O O O O N N C C C C C C C C C C C C C C C C C
charge: -0.223998 -0.258225 -0.301735 -0.261325 -0.262926 -0.330090 -0.235452 -0.236020 -0.236899 -0.243062 -0.073508 -0.153206 0.216942 0.135154 0.148839 0.292905 0.198235 0.117930 0.313107 0.300155 0.319109 0.332563 -0.004069 -0.004038 0.309241 -0.011434 0.100298 0.051340 0.000171
polarizability: 2.31929368e+02 2.04260112e+01 2.37919519e+02 2.90142215e+00 5.16783419e+00 2.21707168e+02
1716.lowfreq: -18.9166 -4.7840 -2.3836 -0.0012 -0.0005 -0.0002 8.4462 12.7768 20.8004
frequency: -18.6544 12.7058 20.7235 24.8670 28.1466 33.0736 35.6354 36.4973 41.8033 45.2581 48.4736 57.1793 61.5781 67.5322 70.3005 73.6898 76.8403 96.7507 129.2909 132.2539 144.3399 153.1056 154.4654 166.0330 180.4626 189.8834 197.2323 213.0533 215.8742 222.7034 256.1995 276.6179 287.0428 306.7139 325.6820 346.6071 367.6221 384.6163 395.8133 407.6124 451.8236 457.4823 493.6686 517.1639 542.3280 548.8097 557.6852 562.8076 567.6325 573.2943 586.7905 599.3467 615.5527 634.0999 637.2872 652.4979 677.3179 710.4940 767.5395 777.7897 790.1396 818.3697 832.0288 849.1065 876.6378 884.2606 911.6745 921.6249 954.4039 964.4907 978.4538 991.3612 995.2323 996.6293 1003.4385 1004.8191 1018.9444 1041.7917 1043.5442 1043.7110 1046.3622 1051.0849 1060.1287 1089.4181 1096.7175 1120.2666 1135.6686 1136.5707 1160.7656 1176.6433 1182.1931 1186.9173 1197.8981 1211.9125 1225.9513 1247.1086 1256.6790 1265.7661 1284.9564 1290.5622 1306.0114 1317.7628 1335.4058 1343.2172 1358.3635 1365.6948 1368.7079 1372.0715 1383.0431 1385.5076 1386.6682 1387.8294 1418.2616 1447.6220 1450.3070 1451.4253 1452.3496 1452.8580 1453.4916 1455.0161 1455.5360 1456.1917 1459.6533 1475.6906 1477.6525 1492.0378 1497.7514 1500.0993 1609.7571 1652.9606 1662.4645 1665.2420 1669.6211 2940.8120 2964.2027 2998.2377 2999.0220 3005.3600 3006.6984 3006.8288 3011.1969 3036.8519 3037.1420 3048.0752 3057.4794 3062.4466 3091.8535 3094.7133 3095.3988 3097.1866 3098.8611 3100.3180 3115.4686 3115.5630 3140.2671 3141.1939 3142.9533 3143.0180 3554.9898
redmass: 1.0218 4.4838 4.8122 2.4289 2.0881 4.8146 4.2444 1.7753 4.2389 3.6902 5.2700 4.5568 4.3793 3.5690 3.7769 1.8108 1.9456 3.5101 2.6264 2.7530 4.9156 1.0466 1.7966 2.5218 5.3477 9.2014 9.3134 2.5647 5.1846 4.0006 6.8035 4.4079 5.7743 2.6350 4.9038 4.2922 3.9150 3.8772 3.4765 3.2808 3.9607 3.2845 4.0299 4.2351 1.2945 3.7095 3.1827 3.3286 3.5110 4.1368 4.9706 4.6413 4.5073 5.0608 5.0423 5.8908 5.7886 10.7427 4.0188 4.5579 5.9199 5.1622 6.1294 5.1002 6.7533 5.5997 4.1135 3.9072 3.8074 4.8187 2.6264 2.0256 2.2097 2.1037 2.7333 2.5048 2.9668 1.6793 1.6581 1.6567 1.9191 2.2163 1.4254 2.8335 1.2342 2.8197 2.1464 1.5107 1.7873 3.2557 3.3070 3.2515 3.5287 2.3914 1.8610 1.1978 1.7650 2.1952 1.3961 1.2289 1.3053 1.3939 1.3121 1.4200 1.5561 1.3856 1.8301 1.4931 1.2504 1.2432 1.2403 1.2664 1.1552 1.1502 1.0898 1.0586 1.0682 1.0568 1.0511 1.0529 1.0488 1.0542 1.0536 1.2379 1.0606 1.0469 1.7357 1.1053 5.3286 10.1396 9.7770 9.8881 9.4153 1.0390 1.0366 1.0830 1.0395 1.0377 1.0375 1.0385 1.1001 1.0581 1.1020 1.0848 1.0853 1.0849 1.0880 1.0968 1.0933 1.0959 1.0951 1.0935 1.1069 1.0964 1.1021 1.1028 1.1015 1.1008 1.0774
irintensity: 0.3726 1.0880 0.7797 0.0832 3.3756 0.6031 2.0133 3.6432 2.3932 1.6020 0.2005 1.8958 2.3517 5.2139 8.7832 3.6989 2.9156 1.1781 0.2863 1.1558 2.9787 0.4718 2.5371 0.8752 3.7702 0.1484 2.6351 1.5617 10.2310 11.3404 6.2523 2.9127 6.9832 8.9992 4.0127 15.3742 24.2380 25.2769 7.5011 3.5975 8.0895 6.4305 9.1531 6.1358 129.2943 2.8577 3.0765 13.2416 5.7376 11.6081 1.4832 10.1501 0.1138 3.6878 16.6701 2.8036 21.9828 14.1654 9.7893 12.5532 17.5919 29.7903 5.1282 97.6525 39.8826 324.8091 36.8122 21.8471 34.1362 107.8801 143.5460 53.7605 116.7035 16.0810 57.7962 72.1744 8.6406 4.6923 5.3050 18.0306 10.6540 89.0536 16.9468 47.7587 0.4872 8.4625 0.8668 0.0226 12.4331 170.3703 503.9029 541.8389 169.4067 65.6988 40.8490 7.7046 33.0223 30.0146 2.3017 0.9958 3.8830 3.0350 6.6642 14.6074 34.7018 5.1709 56.7907 1.1419 34.3574 69.2251 44.1618 56.6027 35.9217 1.3539 14.2391 28.8493 45.9156 21.3924 33.3031 1.7073 18.5030 4.3479 16.2874 237.0538 43.4839 6.5405 276.7724 54.2937 249.5977 158.0480 218.2844 150.5775 158.6458 59.5783 94.1289 9.1619 2.0568 1.6030 2.0009 0.9825 36.3778 18.2809 47.6084 8.0700 12.2282 10.1131 9.3602 6.6917 7.4403 7.1649 21.0973 6.2013 3.4853 1.0372 10.0125 7.5119 12.4064 6.1362 53.4694
temp: 298.150 k
press: 1.00000 atm
elementType: 8 8 8 8 8 8 8 8 8 8 7 7 6 6 6 6 6 6 6 6 6 6 6 6 6 6 6 6 6 1 1 1 1 1 1 1 1 1 1 1 1 1 1 1 1 1 1 1 1 1 1 1 1 1 1
symmnumber: 1
zpe: 1128271.9 jmol-1
zpe.correction: 0.429736 hartree
zpe.thermalcorrener: 0.462779 hartree
zpe.thermalcorrenthalpy: 0.463724 hartree
zpe.thermalcorrgfe: 0.358199 hartree
zpe.sumelectzpe: -1522.927522 hartree
zpe.sumelectthermal: -1522.894478 hartree
zpe.sumelectthermalent: -1522.893534 hartree
zpe.sumelectthermalfe: -1522.999059 hartree
dipole: -0.7296 0.1430 1.1211
dipole: 1.3453
quadrupole: -157.6011 -157.3689 -186.8391
quadrupole: 31.3851 8.8442 10.6158
quadrupole: 9.6686 9.9008 -19.5694 31.3851 8.8442 10.6158
hfenergy: -1523.3572579 hartree
pointgroup: C01 [X(C17H26N2O10)]
dipole: -0.3339804 0.003352 0.4105659 debye
polarizability: 226.1627378|18.1735228|242.6796867|3.2551046|8.0489194|222.7136306 unknown
InChI: InChI=1S/C17H26N2O10/c1-8(20)25-7-12-14(26-9(2)21)15(27-10(3)22)13(18-17(24)19(5)6)16(29-12)28-11(4)23/h12-16,18H,7H2,1-6H3
charge 0 multiplicity 1
55 atoms
O  1.140826 -0.195914 -0.647309
O  -0.656195 1.866256 1.773368
O  -0.59118 -1.797493 1.132436
O  0.899085 2.201423 -0.750182
O  3.653907 -0.800792 0.417919
O  -3.356287 1.262207 -2.036861
O  -1.846089 1.21506 3.676281
O  0.344277 -2.795612 3.025793
O  2.321747 1.990666 -2.60183
O  3.553106 -2.527251 -1.161802
N  -1.884725 -0.247655 -1.031262
N  -3.633826 -1.040883 -2.411814
C  -1.043355 0.583403 1.121681
C  -1.110424 0.827329 -0.406981
C  -0.000015 -0.484099 1.537029
C  1.338322 -0.238337 0.821376
C  0.283897 0.886108 -1.076581
C  2.415255 -1.29555 1.060678
C  -2.986332 0.057402 -1.843243
C  -1.167837 2.073451 3.072042
C  -0.345616 -2.893018 1.991016
C  1.940457 2.634605 -1.60379
C  -0.800909 3.452335 3.566433
C  -1.00962 -4.138552 1.454353
C  4.042066 -1.444596 -0.779359
C  2.492782 3.952311 -1.109811
C  -4.817054 -0.803374 -3.25272
C  -3.180403 -2.422938 -2.203562
C  5.086415 -0.62021 -1.491737
H  -2.036847 0.277721 1.494409
H  -1.646499 1.771253 -0.607442
H  0.135611 -0.488051 2.633584
H  1.71073 0.75058 1.15901
H  0.210686 0.776684 -2.170156
H  2.624757 -1.411311 2.135604
H  2.140646 -2.266577 0.613953
H  -1.585979 -1.204578 -0.838668
H  -1.595389 4.163976 3.27533
H  -0.731378 3.448433 4.664814
H  0.142792 3.795665 3.116125
H  -0.47171 -4.48761 0.554274
H  -0.981192 -4.929285 2.217514
H  -2.053014 -3.930692 1.16406
H  1.672094 4.651386 -0.879624
H  3.161096 4.38402 -1.868693
H  3.060607 3.789074 -0.17598
H  -5.713138 -1.296908 -2.828963
H  -4.990995 0.282722 -3.292288
H  -4.655241 -1.179434 -4.281358
H  -3.807508 -3.099161 -2.80577
H  -2.130709 -2.567844 -2.529091
H  -3.2718 -2.740424 -1.143606
H  5.752062 -0.116777 -0.772951
H  5.665664 -1.256351 -2.177282
H  4.568177 0.158606 -2.082969
