program: Gaussian 09
title: 000290157
version: EM64L-G09RevD.01
frameworkgroup: C1[X(C20H15N3)]
method: RPBEPBE
basis: SDD
operation: Freq
keyword: #pfreq=noraman
keyword: PBEPBE/SDD
title: #p freq=noraman PBEPBE/SDD
converged: YES YES NO NO
title: Mulliken charges:
elementType: N N N C C C C C C C C C C C C C C C C C C C C H H H H H H H H H H H H H H H
charge: -0.405619 -0.169238 -0.008477 0.419277 0.382953 0.398839 0.383135 -0.637907 0.500603 -0.393215 -0.494941 -0.402579 -0.415518 -0.409998 -0.402266 0.154720 -0.407552 -0.410322 -0.375354 -0.239400 -0.245644 -0.243734 -0.240346 0.233294 0.237928 0.264068 0.267952 0.236734 0.240939 0.236901 0.238201 0.238495 0.247611 0.228398 0.229219 0.227977 0.227983 0.306881
chargesum: 0.00000
title: Mulliken charges with hydrogens summed into heavy atoms:
elementType: N N N C C C C C C C C C C C C C C C C C C C C
charge: -0.098738 -0.169238 -0.008477 0.419277 0.382953 0.398839 0.383135 -0.404613 0.500603 -0.155287 -0.230872 -0.134627 -0.178784 -0.169059 -0.165364 0.154720 -0.169351 -0.171828 -0.127743 -0.011002 -0.016424 -0.015757 -0.012363
polarizability: 6.52720142e+02 1.71824191e+01 2.54253570e+02 8.11064249e-01 1.96912551e-01 8.88221570e+01
1716.lowfreq: -0.0009 -0.0004 0.0007 2.3770 6.5812 7.5947 17.9387 26.7669 36.0137
frequency: 14.8229 26.7555 35.9096 70.9739 125.0503 132.3844 176.4052 182.8468 195.7387 203.4139 209.8121 290.2708 305.3745 342.8045 358.2255 400.6816 406.8753 415.9714 462.9383 475.1461 477.1704 510.2716 514.1160 533.1487 540.8660 558.0934 608.8419 624.5671 635.7364 652.6784 663.5783 717.8711 719.1321 756.8404 758.1097 759.7072 761.3917 782.5495 786.0763 804.7767 831.3688 835.3821 863.0246 878.4727 887.6033 901.5608 920.2941 922.7234 947.2642 959.2262 962.8727 972.8078 982.2731 983.8938 990.7892 991.6575 1023.3177 1023.6846 1117.8879 1122.7893 1145.3300 1154.2169 1156.8710 1168.1683 1173.5401 1174.3851 1205.0214 1238.2413 1241.4418 1258.9194 1273.9620 1276.3936 1291.8026 1341.9876 1352.4076 1362.4675 1409.6498 1412.2396 1420.1204 1423.3258 1439.2416 1440.9343 1456.0479 1462.2865 1501.1775 1515.7611 1523.9736 1574.7290 1585.5292 1599.6951 1609.9571 1631.8404 1640.4329 3116.9978 3119.9612 3120.3013 3125.0393 3125.4031 3129.4341 3131.9295 3142.8292 3143.0869 3149.7001 3162.2089 3162.9334 3164.4774 3184.6469 3387.2116
redmass: 4.0604 5.2543 5.9214 5.3750 5.7876 5.1798 4.2814 3.8609 6.5503 4.8163 4.7079 5.9359 4.7198 4.7315 4.7375 3.1675 5.7921 3.5039 5.4222 2.4628 2.5001 6.8961 6.5782 3.4989 3.5964 7.0054 6.7922 6.7282 6.8471 2.8382 2.6521 6.4942 1.2993 1.3141 4.8481 4.9550 1.3412 2.4147 2.6419 5.6683 1.3078 1.3130 1.5174 1.5914 5.0198 1.8560 5.0933 1.6329 3.9657 1.3782 1.3956 3.2042 1.3674 1.3496 1.3593 1.3519 2.2477 2.2614 1.7378 1.7838 1.5622 1.2171 1.8990 1.6592 1.0962 1.1764 1.6366 2.1277 1.7191 1.9443 1.7784 1.7844 2.1504 4.1263 2.0876 2.1646 4.1589 5.4335 3.9975 3.8614 3.5032 3.8833 2.2230 2.2243 2.7114 3.8508 3.3062 7.1777 6.9355 5.8991 5.5237 6.7053 6.7050 1.0912 1.0856 1.0859 1.0890 1.0891 1.0885 1.0899 1.0948 1.0947 1.0910 1.1002 1.1003 1.0963 1.0945 1.0744
irintensity: 0.0403 0.1132 0.0476 0.0870 3.3576 1.6698 0.7109 1.8714 0.8133 1.6799 5.6622 7.4668 0.3471 2.1812 2.9859 0.0755 27.9103 0.5245 8.0087 33.4323 14.2344 2.0639 0.5110 0.4277 0.0130 4.8132 30.1416 1.8989 9.8325 0.7759 0.0137 8.8943 89.5779 31.5037 2.6759 0.0265 67.8958 4.4392 0.0885 0.3373 18.4655 33.7118 73.4000 39.8337 4.1815 15.6874 0.8351 16.6459 7.0283 7.3777 12.0407 0.1195 1.4263 0.5481 0.0065 0.0008 7.3561 6.9068 12.1782 2.7962 62.7420 8.8659 91.6197 66.0634 2.9073 29.6362 166.0149 1.3525 35.7593 44.4929 4.0708 4.8011 273.8850 194.2900 93.9113 81.6718 20.1046 26.1159 23.7592 7.6085 14.8024 13.2514 20.3685 3.6797 332.5914 8.3410 19.0212 1.3120 2.1199 8.4588 81.4606 0.3084 133.8465 11.8687 6.1103 9.0151 0.1601 0.0740 14.1563 6.5487 28.5322 34.8926 4.3032 59.1385 48.9292 14.2590 2.6631 11.8087
temp: 298.150 k
press: 1.00000 atm
elementType: 7 7 7 6 6 6 6 6 6 6 6 6 6 6 6 6 6 6 6 6 6 6 6 1 1 1 1 1 1 1 1 1 1 1 1 1 1 1
symmnumber: 1
zpe: 777244.2 jmol-1
zpe.correction: 0.296037 hartree
zpe.thermalcorrener: 0.313516 hartree
zpe.thermalcorrenthalpy: 0.314460 hartree
zpe.thermalcorrgfe: 0.248655 hartree
zpe.sumelectzpe: -933.813690 hartree
zpe.sumelectthermal: -933.796210 hartree
zpe.sumelectthermalent: -933.795266 hartree
zpe.sumelectthermalfe: -933.861072 hartree
dipole: -1.0237 0.0648 -0.0108
dipole: 1.0258
quadrupole: -108.4419 -114.3299 -143.5322
quadrupole: 2.5195 0.1808 0.1101
quadrupole: 13.6595 7.7714 -21.4309 2.5195 0.1808 0.1101
hfenergy: -934.1097266 hartree
pointgroup: C01 [X(C20H15N3)]
dipole: 0.4018805 -0.0295165 -0.0223261 debye
polarizability: 652.842171|12.1933256|244.7145848|-12.9769859|37.3931195|98.2391131 unknown
InChI: InChI=1S/C20H15N3/c1-3-7-17-13-19(11-9-15(17)5-1)21-23-22-20-12-10-16-6-2-4-8-18(16)14-20/h1-14,21H
charge 0 multiplicity 1
38 atoms
N  1.115149 1.270312 0.310464
N  -1.057497 1.639498 0.462489
N  -0.136429 0.733395 0.222096
C  4.730636 0.365654 -0.014367
C  4.63647 -1.046904 -0.327404
C  -4.166564 -0.516437 0.008271
C  -5.178882 0.483483 0.298206
C  3.531646 1.116151 0.194466
C  2.274795 0.498839 0.098596
C  3.333496 -1.643268 -0.416759
C  -2.786593 -0.155798 0.05704
C  2.175224 -0.901711 -0.211521
C  6.030571 0.967775 0.07564
C  5.836972 -1.798332 -0.536673
C  -4.755763 1.815056 0.626399
C  -2.400536 1.157595 0.382982
C  -4.588683 -1.850318 -0.321869
C  -6.5616 0.111796 0.247077
C  -3.404483 2.145939 0.667798
C  7.18469 0.208958 -0.13426
C  7.090035 -1.185631 -0.442897
C  -5.943578 -2.182512 -0.363489
C  -6.940036 -1.193752 -0.076641
H  3.606471 2.185413 0.431253
H  3.257817 -2.711218 -0.653252
H  -2.019457 -0.906067 -0.161339
H  1.185158 -1.357732 -0.279994
H  6.107027 2.035869 0.312283
H  5.759322 -2.866359 -0.773127
H  -5.51535 2.574639 0.845169
H  -3.82571 -2.606952 -0.541164
H  -7.322414 0.870519 0.466705
H  -3.067775 3.157475 0.916041
H  8.171312 0.680007 -0.062973
H  8.00338 -1.768059 -0.604815
H  -6.252712 -3.202726 -0.616145
H  -8.000084 -1.467904 -0.112822
H  1.182774 2.274208 0.541041
