program: Gaussian 09
title: 000290156
version: EM64L-G09RevD.01
frameworkgroup: C1[X(C16H15N3O2)]
method: RPBEPBE
basis: SDD
operation: Freq
keyword: #p
keyword: freq=noraman
keyword: PBEPBE/SDD
title: #p freq=noraman PBEPBE/SDD
converged: YES YES NO NO
title: Mulliken charges:
elementType: O O N N N C C C C C C C C C C C C C C C C H H H H H H H H H H H H H H H
charge: -0.229208 -0.226052 -0.394985 -0.160327 -0.007155 0.316424 0.485043 0.307752 -0.320596 -0.333560 -0.380673 -0.421780 0.173895 -0.327865 -0.335020 -0.364633 -0.300009 0.118788 0.124678 -0.788346 -0.788473 0.245721 0.281074 0.267569 0.230744 0.245411 0.278921 0.251506 0.261886 0.313300 0.237769 0.238035 0.262252 0.237902 0.238154 0.261855
chargesum: 0.00000
title: Mulliken charges with hydrogens summed into heavy atoms:
elementType: O O N N N C C C C C C C C C C C C C C C C
charge: -0.229208 -0.226052 -0.081685 -0.160327 -0.007155 0.316424 0.485043 0.307752 -0.074875 -0.052486 -0.113104 -0.191036 0.173895 -0.082454 -0.056098 -0.113127 -0.038123 0.118788 0.124678 -0.050289 -0.050561
polarizability: 5.74861433e+02 -4.51910010e+00 2.05996761e+02 -4.82354033e-01 -5.45605871e-01 8.69878954e+01
1716.lowfreq: -5.7644 -0.0011 -0.0008 0.0007 1.8902 3.1489 20.2380 27.9256 33.4225
frequency: 20.1924 27.9061 33.4206 58.3918 69.1691 71.3344 116.9108 119.2327 141.4833 141.6423 171.9027 187.5193 208.7903 212.4104 238.5710 290.3858 326.2742 339.8799 387.2517 404.1294 408.1392 409.8681 457.7385 475.7965 496.7704 510.1909 543.0962 585.5664 591.1845 595.9340 604.8067 629.0914 636.7410 685.1493 730.3183 732.4228 740.8619 750.7924 814.3712 840.2440 846.3849 849.0724 873.1606 915.9804 945.3485 946.7822 976.0793 976.8755 993.3433 999.5616 1000.2494 1008.0109 1026.5239 1027.7871 1070.2879 1071.8911 1113.5152 1117.2620 1160.5420 1166.8457 1182.0571 1215.4952 1261.9555 1274.3109 1278.9157 1300.5482 1311.7199 1345.7470 1367.1168 1368.6001 1376.7430 1385.1742 1425.3600 1428.8788 1446.5647 1447.1612 1462.2540 1463.3861 1474.7459 1485.3936 1518.1112 1558.7135 1568.5221 1587.2329 1595.1554 1615.5283 1621.4696 2984.3466 2985.3167 3068.2223 3069.5098 3125.1858 3125.7875 3126.6858 3147.7974 3149.5686 3150.9789 3162.5488 3168.9573 3173.5866 3185.4417 3384.1404
redmass: 3.6679 5.4358 6.2784 5.1201 5.0684 3.7158 5.9975 5.9287 1.0326 1.0404 5.7355 7.6961 5.4471 4.6060 4.5655 5.4167 5.3168 5.7790 5.3708 4.0142 2.9455 2.9269 3.7024 6.2002 3.1664 3.4289 5.7693 4.3546 2.3195 2.2965 5.7226 7.1547 6.5020 5.2614 1.3116 5.4185 3.5308 3.4231 6.2402 1.2555 1.3202 1.5737 1.4903 4.5424 2.1921 2.1800 1.3482 1.3639 1.3585 2.9515 2.8985 1.3757 1.8173 1.7730 2.5083 2.4619 1.5056 1.3468 3.1082 1.3247 1.1512 2.8226 2.1895 3.3181 3.5798 1.3437 1.4097 7.7231 1.5508 1.2762 2.8926 5.5910 4.4676 4.0599 1.1009 1.0992 1.0498 1.0495 1.9031 2.5224 3.0107 6.7024 5.5966 7.1561 6.8280 6.7764 6.6528 1.0376 1.0376 1.0969 1.0969 1.0990 1.0990 1.0896 1.0875 1.0883 1.0891 1.0950 1.0961 1.0964 1.0951 1.0746
irintensity: 2.4461 1.2971 0.6250 1.1572 1.7424 6.1641 1.0628 2.3301 0.2005 0.8520 6.4506 0.0663 10.7193 9.0182 6.4573 0.0055 4.7289 1.7835 0.3376 1.1937 0.0119 0.0027 5.4697 8.3895 13.9573 1.5177 50.9237 3.3372 17.4500 13.2701 1.8085 0.3902 0.9664 58.9851 78.1993 1.1208 0.0414 3.5353 0.2928 0.4088 8.7889 90.8637 62.7995 1.5460 157.5184 10.1843 0.0011 0.5533 1.0410 0.1920 3.5461 0.8368 1.3583 0.9167 0.7729 1.7099 56.1738 3.2288 368.4615 3.8049 68.1449 124.9357 725.7118 479.2778 193.5525 7.6615 64.3299 246.3902 4.0650 106.3122 80.4054 10.7806 20.1029 12.2470 52.7517 28.7837 20.9685 20.9990 153.2705 8.9109 244.2616 38.2954 183.1169 226.9587 245.8113 28.0336 152.7895 3.5556 3.3134 12.8504 12.5861 25.4460 22.0027 10.0593 9.4909 0.0083 9.8050 3.8339 15.6549 0.0152 2.0514 12.4895
temp: 298.150 k
press: 1.00000 atm
elementType: 8 8 7 7 7 6 6 6 6 6 6 6 6 6 6 6 6 6 6 6 6 1 1 1 1 1 1 1 1 1 1 1 1 1 1 1
symmnumber: 1
zpe: 725333.7 jmol-1
zpe.correction: 0.276265 hartree
zpe.thermalcorrener: 0.295775 hartree
zpe.thermalcorrenthalpy: 0.296719 hartree
zpe.thermalcorrgfe: 0.225782 hartree
zpe.sumelectzpe: -931.885561 hartree
zpe.sumelectthermal: -931.866051 hartree
zpe.sumelectthermalent: -931.865107 hartree
zpe.sumelectthermalfe: -931.936044 hartree
dipole: -1.3680 -2.2944 0.0812
dipole: 2.6725
quadrupole: -154.4705 -113.4669 -126.0479
quadrupole: 28.8495 -0.5841 0.1001
quadrupole: -23.1421 17.8615 5.2805 28.8495 -0.5841 0.1001
hfenergy: -932.1618255 hartree
pointgroup: C01 [X(C16H15N3O2)]
dipole: -0.536226 -0.8088393 -0.4047132 debye
polarizability: 573.7305462|-13.6882847|182.3964936|19.6595054|47.1435844|111.7190503 unknown
InChI: InChI=1S/C16H15N3O2/c1-11(20)13-3-7-15(8-4-13)17-19-18-16-9-5-14(6-10-16)12(2)21/h3-10,17H,1-2H3
charge 0 multiplicity 1
36 atoms
O  7.406868 0.023293 0.185461
O  -6.353614 2.334794 0.549519
N  1.141776 -1.157019 -0.791547
N  -1.061889 -1.149982 -0.901323
N  -0.005038 -0.475835 -0.50449
C  5.015007 0.288072 0.182639
C  2.410908 -0.652713 -0.458688
C  -4.905568 0.575949 -0.229096
C  3.861195 1.052996 0.510533
C  4.836091 -0.96081 -0.475832
C  2.56947 0.597771 0.198116
C  3.554848 -1.430774 -0.795211
C  -2.305576 -0.502913 -0.641302
C  -4.742532 -0.698988 -0.835477
C  -3.744166 1.302502 0.166552
C  -3.457427 -1.232568 -1.040538
C  -2.460253 0.77929 -0.031969
C  6.408823 0.739285 0.500636
C  -6.254079 1.191102 0.012268
C  6.60688 2.076304 1.209254
C  -7.502782 0.416829 -0.399154
H  3.969517 2.01758 1.017043
H  5.729992 -1.542255 -0.724218
H  1.684615 1.185927 0.45158
H  3.431074 -2.395443 -1.302438
H  -5.617353 -1.277348 -1.149058
H  -3.892562 2.283386 0.630678
H  -3.313611 -2.212389 -1.506709
H  -1.570707 1.338462 0.272035
H  1.043166 -2.070317 -1.263475
H  6.093646 2.088843 2.18894
H  6.197097 2.910274 0.609118
H  7.683375 2.242141 1.365548
H  -7.55546 -0.559777 0.117211
H  -7.506879 0.217316 -1.487172
H  -8.392752 1.009715 -0.139833
