program: Gaussian 09
title: 000290154
version: EM64L-G09RevD.01
frameworkgroup: C1[X(C11H12O)]
method: RPBEPBE
basis: SDD
operation: Freq
keyword: #pfreq=noraman
keyword: PBEPBE/SDD
title: #p freq=noraman PBEPBE/SDD
converged: YES YES NO NO
title: Mulliken charges:
elementType: O C C C C C C C C C C C H H H H H H H H H H H H
charge: -0.172018 -0.351119 -0.469311 -0.421840 -0.502073 0.109715 0.561072 -0.456506 -0.374152 -0.220442 -0.238664 -0.245735 0.252759 0.238839 0.225382 0.215000 0.227518 0.254071 0.242640 0.227172 0.221332 0.224917 0.223427 0.228014
chargesum: 0.00000
title: Mulliken charges with hydrogens summed into heavy atoms:
elementType: O C C C C C C C C C C C
charge: -0.172018 -0.098360 -0.005090 0.020678 -0.005362 0.109715 0.561072 -0.229334 -0.152819 0.004475 -0.015237 -0.017721
polarizability: 1.50374623e+02 -2.27205407e+00 9.00168727e+01 3.11196503e+00 1.28420706e+01 9.70390834e+01
1716.lowfreq: -16.0085 -3.2168 -0.0007 -0.0004 -0.0001 6.4460 19.0486 61.2756 90.3891
frequency: 17.9933 61.2364 90.3876 144.7916 229.9585 253.7872 302.9107 403.3367 414.0942 461.6154 532.0704 551.8661 588.9860 616.7688 634.3249 702.5748 707.1335 765.0133 825.9614 848.0450 849.9932 896.2204 908.8401 925.2445 954.2359 972.3059 990.7596 993.1189 1013.8598 1027.7685 1055.3276 1074.8270 1109.1026 1135.0374 1160.7533 1172.2070 1189.6886 1197.5961 1208.4412 1260.7432 1270.2936 1270.8191 1303.9844 1311.1091 1336.7082 1382.9239 1428.3021 1441.1523 1474.1757 1481.1328 1485.5048 1592.8421 1614.5289 1659.5782 2952.2939 2987.7839 3001.4985 3002.8682 3067.8756 3072.7256 3083.1779 3115.1658 3115.9053 3132.2731 3144.4939 3162.9784
redmass: 4.2713 3.0636 4.6350 3.0779 2.0709 4.1961 4.7859 2.7956 2.9206 4.6663 3.1756 2.9836 2.5828 6.4081 4.3879 1.8804 2.4758 2.0077 1.9313 1.3913 2.4159 1.7214 1.8278 1.8299 1.5255 1.3986 3.6741 1.5303 1.8631 2.1750 2.2534 1.6921 3.0534 1.8751 1.4014 1.0556 1.1141 1.4628 1.5830 1.3011 1.5098 1.6638 1.3751 1.5114 1.3556 7.6782 1.0806 2.1806 1.0909 1.1830 2.0037 6.0601 6.2313 12.3744 1.0809 1.0657 1.0660 1.0619 1.0955 1.0991 1.1037 1.0873 1.0871 1.0906 1.0957 1.1015
irintensity: 0.9833 2.9041 2.1850 1.6104 0.5087 0.8860 0.0917 0.0042 0.6069 4.6192 13.1602 10.7188 7.5139 0.2897 3.0943 46.3101 10.5587 38.2105 16.8717 0.6615 2.4798 4.2473 4.5229 3.9816 4.6344 0.2896 0.4029 0.2780 14.4423 7.2825 3.3329 10.3144 31.5962 45.3526 14.5611 0.1161 0.1218 0.7883 0.7534 10.2123 3.4937 9.4846 0.6637 3.7113 3.8712 0.6924 21.0555 7.5083 8.1268 12.7719 17.1242 1.5900 10.6530 155.4543 11.8211 10.7275 21.1635 42.6729 18.0481 23.6139 38.4927 9.5679 8.9223 10.9187 43.4929 22.8587
temp: 298.150 k
press: 1.00000 atm
elementType: 8 6 6 6 6 6 6 6 6 6 6 6 1 1 1 1 1 1 1 1 1 1 1 1
symmnumber: 1
zpe: 521219.1 jmol-1
zpe.correction: 0.198522 hartree
zpe.thermalcorrener: 0.208798 hartree
zpe.thermalcorrenthalpy: 0.209743 hartree
zpe.thermalcorrgfe: 0.161021 hartree
zpe.sumelectzpe: -500.721269 hartree
zpe.sumelectthermal: -500.710993 hartree
zpe.sumelectthermalent: -500.710048 hartree
zpe.sumelectthermalfe: -500.758770 hartree
dipole: 1.0563 -2.7947 1.2943
dipole: 3.2559
quadrupole: -60.7959 -78.0779 -68.0604
quadrupole: -3.3232 1.7162 7.8802
quadrupole: 8.1822 -9.0998 0.9176 -3.3232 1.7162 7.8802
hfenergy: -500.9197911 hartree
pointgroup: C01 [X(C11H12O1)]
dipole: 0.4045359 -1.032259 0.6416339 debye
dipolederiv: -0.5126665 0.0695482 -0.1076667 -0.0399529 -0.797604 0.3270261 -0.0472745 0.2869508 -0.4885351 -0.2999464 -0.1973228 -0.0301071 -0.254952 -0.2223174 0.1131787 -0.1518472 0.0385771 0.1481324 -0.0441439 -0.0183739 0.0148328 -0.0425435 0.1191675 0.0562581 0.0579803 -0.0304499 0.0938353 0.0102291 -0.0061821 0.0096628 0.0034432 0.0726205 0.017003 -0.0816044 0.0697561 0.148661 -0.4021165 0.035847 -0.2366863 -0.1249795 -0.0009295 0.025806 -0.2256801 0.0900236 -0.0278075 0.9384304 0.1084901 0.2734194 0.395469 0.8863853 -0.4128267 0.26021 -0.3338786 0.3678834 0.4506294 -0.0089455 -0.0308076 -0.1040921 -0.064485 0.0107868 -0.0420857 0.0386834 -0.0541532 -0.1821483 -0.0243048 -0.0271351 -0.0075053 -0.0617299 0.1088777 -0.0368618 0.1148629 -0.0040048 -0.0956155 0.0452979 0.0508168 0.1149601 -0.0691585 0.0731527 0.0962161 0.0533079 -0.0550564 0.0403145 0.0450967 0.0644747 0.0521922 -0.0667609 0.0935277 0.0726789 0.0912763 -0.0161427 -0.0196685 -0.0291057 -0.0224574 -0.0444104 -0.0318472 0.135045 -0.0441597 0.133781 0.0094066 0.0544524 -0.0300901 -0.0272594 -0.0254959 -0.1336968 0.046337 -0.0098453 0.0484662 -0.1156073 0.057028 -0.0185092 0.012388 0.0218701 0.0257917 -0.0583288 0.0592847 -0.0426933 -0.0759137 0.0434678 -0.0659581 -0.0014896 -0.0416369 -0.152958 0.0391043 0.000393 -0.0037433 0.0758944 0.0295807 0.0242522 0.0589493 0.0316616 0.0488383 -0.0977486 0.079142 -0.0342061 -0.0935785 0.0292066 0.0249663 0.0471422 0.0467144 -0.0313121 -0.0769083 0.1206579 -0.1142289 -0.0600322 -0.0708436 0.0507643 -0.1052805 0.0264903 0.0561389 0.0374146 -0.1399406 0.0671266 -0.0641971 -0.0347949 -0.0482748 0.0699289 -0.0311803 0.037841 0.0649633 0.1062665 0.0611356 0.0369859 0.0925161 0.0406834 0.0181727 0.0377427 -0.0025111 -0.0598878 -0.0288621 -0.0970708 -0.0167654 0.0610161 0.0608484 0.070522 0.0403243 0.0487101 -0.1148569 0.0506474 -0.1138976 -0.0018486 -0.0288613 -0.0685185 -0.0914798 -0.0727629 0.0795237 -0.0653099 -0.0918417 -0.0623048 0.0473383 -0.034551 -0.0619579 -0.0845592 -0.0706788 0.086118 -0.0905566 -0.0956714 -0.0900998 0.038547 0.0509611 0.0359583 0.0418899 0.0513637 0.0466548 -0.1303274 0.0577963 -0.1297245 -0.0045473 -0.1324756 0.0357905 0.0327291 0.0379589 0.1275205 -0.04173 0.0344014 -0.0416497 0.1115055 unknown
polarizability: 150.3278488|-2.4790966|93.3315589|3.5141741|13.2742935|93.7711716 unknown
InChI: InChI=1S/C11H12O/c12-11-8-4-7-10(11)9-5-2-1-3-6-9/h1-3,5-6,10H,4,7-8H2
charge 0 multiplicity 1
24 atoms
O  1.427391 1.760411 -1.178103
C  0.867629 -0.54074 -0.370273
C  1.600553 -1.325173 0.758254
C  3.104996 -1.007925 0.530217
C  3.111654 0.486025 0.127452
C  1.755413 0.723017 -0.559947
C  -0.61075 -0.274439 -0.148861
C  -1.59047 -0.89012 -0.966306
C  -1.04275 0.582542 0.897488
C  -2.968065 -0.666595 -0.742363
C  -2.416735 0.810913 1.123393
C  -3.386428 0.184054 0.305542
H  0.987686 -1.114503 -1.315884
H  1.376242 -2.404728 0.727345
H  1.271386 -0.945738 1.744602
H  3.499638 -1.626802 -0.297869
H  3.720044 -1.214678 1.422397
H  3.943607 0.793632 -0.529048
H  3.14992 1.141338 1.021533
H  -1.272618 -1.546868 -1.785933
H  -0.300687 1.085468 1.530465
H  -3.711237 -1.151336 -1.385527
H  -2.733134 1.480307 1.931461
H  -4.453485 0.362038 0.479866
