program: Gaussian 09
title: 000290149
version: EM64L-G09RevD.01
frameworkgroup: C1[X(C16H16O4)]
method: RPBEPBE
basis: SDD
operation: Freq
keyword: #pfreq=noraman
keyword: PBEPBE/SDD
title: #p freq=noraman PBEPBE/SDD
converged: YES YES NO NO
title: Mulliken charges:
elementType: O O O O C C C C C C C C C C C C C C C C H H H H H H H H H H H H H H H H
charge: -0.272902 -0.213741 -0.206043 -0.258540 0.085889 -0.530275 0.396626 -0.617789 -0.577445 0.155415 0.356616 -0.523482 0.114728 0.186474 -0.355602 -0.544206 0.326205 -0.383877 -0.505399 -0.535743 0.246845 0.229173 0.260388 0.258914 0.243420 0.233240 0.265416 0.238476 0.259641 0.246293 0.234015 0.242417 0.245279 0.248595 0.224774 0.226205
chargesum: 0.00000
title: Mulliken charges with hydrogens summed into heavy atoms:
elementType: O O O O C C C C C C C C C C C C C C C C
charge: -0.272902 -0.213741 -0.206043 -0.258540 0.085889 -0.054258 0.396626 -0.098486 -0.100785 0.155415 0.356616 -0.258067 0.114728 0.186474 -0.117126 -0.284566 0.326205 -0.137584 0.216313 0.163831
polarizability: 2.89966374e+02 -3.08619889e+01 1.84540867e+02 -1.15767660e+01 -2.02190347e+01 1.26791612e+02
1716.lowfreq: -9.5754 0.0003 0.0004 0.0005 3.3866 5.8726 24.7205 37.0265 55.2327
frequency: 24.4966 36.9689 55.1869 82.1958 93.6212 111.3274 121.7978 138.8093 159.0075 179.2351 216.3863 224.6911 235.6815 256.2224 265.6908 301.4727 312.5605 332.2947 342.6660 408.3309 425.0229 437.2367 488.7731 508.0199 520.6623 544.0019 564.5125 579.0809 606.9350 636.8051 680.1411 707.1174 734.3622 744.0391 751.9087 806.7475 817.0038 841.3245 859.4660 874.0878 885.4754 898.3579 911.4505 927.1331 950.3941 969.0293 994.8525 1011.6084 1051.9574 1071.9855 1097.6787 1112.7689 1114.1046 1127.6730 1136.3525 1144.0843 1147.5756 1157.4019 1183.8784 1193.6153 1219.2361 1228.6314 1238.6746 1245.5284 1265.3708 1272.8838 1320.6927 1324.4348 1349.5683 1381.2867 1422.3830 1435.4265 1439.9180 1442.1419 1452.4546 1457.2361 1461.7477 1465.0773 1469.5587 1473.3209 1488.6522 1563.2551 1599.2041 1622.1838 1628.4339 1630.8525 2966.5608 2967.8112 2998.9151 3004.8839 3007.8505 3035.6037 3057.5750 3078.0149 3080.4657 3106.8999 3130.4282 3141.4804 3147.2939 3149.7915 3170.6996 3182.9522
redmass: 5.9371 5.1296 6.2465 3.5136 3.9521 1.2039 2.3909 4.9771 4.1462 4.2417 3.9065 2.4071 1.4719 2.8681 3.0305 4.2714 4.4277 3.2482 3.9693 5.1072 5.2284 2.8655 4.0324 4.6625 3.2589 3.8994 3.4684 5.9311 3.5969 4.5882 3.2107 5.8936 4.5193 5.5592 3.3297 3.6235 1.5647 3.6194 2.3394 1.6917 2.3781 1.6578 2.6902 5.8125 1.4007 2.3734 4.4573 2.5455 2.2102 4.0951 2.3693 1.2591 1.2680 2.4904 1.8417 1.4201 1.4220 1.4459 1.5206 1.9525 1.5134 2.2979 2.0021 2.4778 2.2646 1.8551 1.5477 1.8338 1.8115 6.3241 1.1712 1.4074 1.0933 2.4894 1.0511 1.1347 1.1203 1.0549 1.0517 1.0936 2.4590 6.6680 7.8868 8.4620 9.2068 10.2235 1.0327 1.0657 1.0643 1.0295 1.0641 1.0938 1.1043 1.0999 1.0986 1.1045 1.0998 1.0885 1.0916 1.1050 1.0951 1.0968
irintensity: 0.8649 0.9935 1.5990 5.5012 1.3023 0.9031 3.0792 2.2360 1.0181 4.9532 2.6905 0.6320 0.4546 6.0965 7.3051 2.5966 9.6026 2.9563 9.9766 6.1075 9.9390 4.3631 4.9760 5.5405 0.9821 1.4979 5.1289 18.4661 4.3656 8.6820 6.8162 3.4370 6.4798 1.3354 0.9591 9.3007 35.7174 11.4299 1.6571 20.3254 4.2763 11.9286 18.7614 4.1799 0.4366 23.0391 56.1507 14.7372 48.0018 46.2590 118.2374 0.3796 0.1802 192.4689 50.1624 21.8670 11.8114 19.4182 7.8933 104.6554 15.4071 168.0806 9.1695 45.0410 41.6319 103.3590 17.0018 26.2904 15.9939 39.5394 13.2103 17.7705 11.6466 1.2563 13.6912 11.2985 9.5151 16.5429 16.0135 63.9953 52.0940 71.4523 692.0238 166.9507 48.8058 164.7114 78.9680 15.5266 18.5173 34.6117 12.5196 30.4539 42.8522 18.9790 8.2032 20.9358 24.8257 5.6677 4.3354 14.8964 12.8257 5.9487
temp: 298.150 k
press: 1.00000 atm
elementType: 8 8 8 8 6 6 6 6 6 6 6 6 6 6 6 6 6 6 6 6 1 1 1 1 1 1 1 1 1 1 1 1 1 1 1 1
symmnumber: 1
zpe: 743112.1 jmol-1
zpe.correction: 0.283036 hartree
zpe.thermalcorrener: 0.301404 hartree
zpe.thermalcorrenthalpy: 0.302348 hartree
zpe.thermalcorrgfe: 0.235813 hartree
zpe.sumelectzpe: -918.738899 hartree
zpe.sumelectthermal: -918.720532 hartree
zpe.sumelectthermalent: -918.719587 hartree
zpe.sumelectthermalfe: -918.786122 hartree
dipole: 4.5450 -3.8019 1.0166
dipole: 6.0120
quadrupole: -104.5106 -118.9544 -117.0602
quadrupole: 27.1201 -8.0405 -0.6799
quadrupole: 8.9978 -5.4460 -3.5518 27.1201 -8.0405 -0.6799
hfenergy: -919.0219354 hartree
pointgroup: C01 [X(C16H16O4)]
dipole: 1.807006 1.4814722 -0.3670044 debye
polarizability: 290.3255875|29.8751541|184.3224063|13.3337149|-19.4649314|126.6508599 unknown
InChI: InChI=1S/C16H16O4/c1-19-12-3-4-13-10(7-12)5-6-16(15(18)20-2)9-11(17)8-14(13)16/h3-4,7-8H,5-6,9H2,1-2H3
charge 0 multiplicity 1
36 atoms
O  -2.718998 2.166722 0.158718
O  -3.548677 -3.11488 0.045454
O  -1.666151 0.948321 1.835377
O  4.770778 0.622462 -0.065495
C  -1.738822 0.052705 -0.49895
C  -1.200959 0.764132 -1.769231
C  -0.695262 -0.980356 -0.041281
C  -3.037002 -0.790495 -0.704503
C  0.141815 1.465845 -1.46162
C  0.714533 -0.59249 -0.009779
C  1.139735 0.587422 -0.708794
C  -1.27646 -2.199656 0.217585
C  -2.715777 -2.175548 -0.095318
C  -1.993896 1.067027 0.635616
C  1.685942 -1.367699 0.679274
C  2.501664 0.938476 -0.699849
C  3.45365 0.157226 -0.000946
C  3.043993 -1.008934 0.699441
C  -3.097089 3.172456 1.182261
C  5.803844 -0.141011 0.643671
H  -1.937246 1.499383 -2.135601
H  -1.059719 -0.003558 -2.554795
H  -3.255148 -0.912766 -1.782451
H  -3.937113 -0.354316 -0.240518
H  -0.062417 2.372074 -0.854074
H  0.602104 1.828062 -2.399664
H  -0.773566 -3.10898 0.554067
H  1.362799 -2.256521 1.231722
H  2.855621 1.826102 -1.235138
H  3.76092 -1.62179 1.25264
H  -3.653819 3.940694 0.627844
H  -2.194509 3.594707 1.655044
H  -3.725702 2.706512 1.95952
H  6.740834 0.401275 0.451772
H  5.881385 -1.172664 0.250258
H  5.604116 -0.169137 1.731943
