program: Gaussian 09
title: 000290148
version: EM64L-G09RevD.01
frameworkgroup: C1[X(C14H16O3)]
method: RPBEPBE
basis: SDD
operation: Freq
keyword: #pfreq=noraman
keyword: PBEPBE/SDD
title: #p freq=noraman PBEPBE/SDD
converged: YES YES NO NO
title: Mulliken charges:
elementType: O O O C C C C C C C C C C C C C C H H H H H H H H H H H H H H H H
charge: -0.236013 -0.259353 -0.224958 -0.113017 -0.471816 -0.583915 0.431609 0.017553 -0.564949 0.118834 -0.557910 -0.358636 0.229446 0.335555 -0.378458 -0.770185 -0.535637 0.266210 0.208836 0.243154 0.231798 0.234078 0.234091 0.288524 0.261736 0.278665 0.246863 0.231137 0.253555 0.242636 0.225767 0.248468 0.226330
chargesum: 0.00000
title: Mulliken charges with hydrogens summed into heavy atoms:
elementType: O O O C C C C C C C C C C C C C C
charge: -0.236013 -0.259353 -0.224958 0.153193 -0.019826 -0.118039 0.431609 0.017553 -0.042333 0.118834 -0.296173 -0.079971 0.229446 0.335555 -0.131595 -0.042857 0.164927
polarizability: 2.52094038e+02 6.48232080e+00 1.51750948e+02 1.33282705e+00 2.95175216e+00 9.40318978e+01
1716.lowfreq: -33.7879 -0.0005 0.0001 0.0005 1.3621 5.1747 11.3176 26.2473 49.9566
frequency: -33.7719 26.1175 49.8298 71.6090 79.7822 105.0493 121.8798 171.8322 181.9202 220.5313 225.4300 253.6124 267.6072 285.3340 322.8528 353.6529 373.7478 441.5209 453.6766 461.4598 483.2420 522.7103 550.7361 561.5264 580.1063 635.7049 658.5249 709.7453 720.9011 763.0445 795.7892 828.2637 847.3212 862.9922 886.8442 898.4152 924.9287 950.0175 979.3367 983.2117 996.7630 1016.6430 1059.0817 1087.0405 1109.7781 1112.5780 1130.8651 1144.2712 1150.7703 1170.5347 1175.2118 1192.2098 1227.1606 1235.7560 1243.1537 1264.2173 1282.8851 1309.1188 1326.7882 1336.5136 1362.4628 1370.0000 1384.3769 1428.6158 1435.2109 1443.8089 1444.2806 1453.5566 1455.1570 1468.8441 1471.3830 1473.2563 1486.9349 1552.4462 1573.8298 1625.5449 1629.1133 2936.3549 2961.2532 2962.9318 2968.2400 2982.5395 2984.5030 3009.9203 3039.4384 3058.9599 3059.7905 3067.5867 3120.7865 3131.1612 3146.7302 3148.9324 3169.7105
redmass: 1.3469 4.8084 5.6937 2.0338 3.8522 4.5584 3.5651 4.1514 3.3011 1.2522 4.1257 2.2559 2.8941 3.5160 5.2573 4.0442 3.1408 3.1678 3.4633 2.4065 3.5824 4.6266 4.9422 3.9765 4.5926 3.4454 3.0041 5.6388 4.5299 3.3182 1.8058 1.5166 2.6162 1.9936 3.3195 1.5662 2.6170 1.9253 1.7594 1.3455 4.1710 2.1866 2.2917 2.8060 1.8946 1.2702 1.4849 1.4182 1.6137 1.7107 1.4657 1.4907 1.5669 1.8244 1.8505 2.3529 1.5751 1.6023 1.4678 1.7684 1.7430 1.2481 8.3739 1.0834 1.3420 1.5316 1.6358 1.1312 1.0550 1.0499 1.0959 1.1015 2.5009 10.4171 7.4361 7.2473 7.1856 1.0786 1.0615 1.0655 1.0325 1.0383 1.0630 1.0962 1.0942 1.0999 1.1043 1.0954 1.1004 1.1001 1.0885 1.0913 1.0954
irintensity: 2.5755 0.8432 3.6016 1.9719 1.0973 11.0130 3.6156 10.6508 2.5046 0.0563 5.5124 4.4058 1.5863 1.4953 2.9422 0.4315 0.9673 3.6082 7.0702 1.0395 48.3829 1.5571 14.0921 6.6124 5.3285 2.4170 7.0262 2.9200 3.2827 4.3319 0.6180 33.0102 5.5570 7.7667 3.9863 26.3230 29.3348 3.9298 37.2559 2.4596 40.9794 6.1733 1.6973 10.2693 32.3668 1.0944 61.3558 24.1168 20.2276 12.9471 38.6266 19.0198 88.1944 3.6887 8.5996 342.2263 153.1259 51.4380 0.4410 49.6411 16.5831 71.3267 18.6866 25.8035 5.4386 15.6799 20.3766 12.8914 21.2546 14.2968 7.2593 52.3402 14.8909 112.4476 220.2705 197.3852 83.8413 15.2567 41.4744 23.3741 67.3942 5.8177 44.0400 11.8971 31.1420 23.7870 43.6164 13.7522 15.5982 22.6575 0.9425 3.8607 15.4691
temp: 298.150 k
press: 1.00000 atm
elementType: 8 8 8 6 6 6 6 6 6 6 6 6 6 6 6 6 6 1 1 1 1 1 1 1 1 1 1 1 1 1 1 1 1
symmnumber: 1
zpe: 699754.5 jmol-1
zpe.correction: 0.266522 hartree
zpe.thermalcorrener: 0.282174 hartree
zpe.thermalcorrenthalpy: 0.283119 hartree
zpe.thermalcorrgfe: 0.222735 hartree
zpe.sumelectzpe: -767.508196 hartree
zpe.sumelectthermal: -767.492544 hartree
zpe.sumelectthermalent: -767.491600 hartree
zpe.sumelectthermalfe: -767.551983 hartree
dipole: -2.7332 0.0816 1.9586
dipole: 3.3635
quadrupole: -74.9140 -105.5590 -102.5859
quadrupole: -1.5764 9.1116 -2.1406
quadrupole: 19.4389 -11.2060 -8.2329 -1.5764 9.1116 -2.1406
hfenergy: -767.7747182 hartree
pointgroup: C01 [X(C14H16O3)]
dipole: -1.0892094 0.0114675 -0.7513903 debye
polarizability: 251.9485854|-6.5389404|151.3075435|-4.5403059|6.1187318|94.6207556 unknown
InChI: InChI=1S/C14H16O3/c1-9(15)7-11-4-3-10-8-12(17-2)5-6-13(10)14(11)16/h5-6,8,11H,3-4,7H2,1-2H3
charge 0 multiplicity 1
33 atoms
O  0.993925 -2.265215 -0.05496
O  -4.694816 0.802469 0.051576
O  4.335463 1.042313 0.920787
C  1.833488 0.033976 0.030341
C  1.389102 1.3654 -0.623311
C  0.100944 1.893643 0.040288
C  -1.010517 0.854825 0.020842
C  0.717667 -1.023786 -0.022445
C  3.150495 -0.518081 -0.540247
C  -0.69098 -0.541422 -0.003437
C  -2.36121 1.247206 0.035695
C  -1.741554 -1.496473 -0.003796
C  4.399349 0.15587 0.024802
C  -3.398429 0.281584 0.036553
C  -3.09022 -1.106455 0.018052
C  5.738045 -0.326119 -0.522296
C  -5.817098 -0.143447 0.048534
H  2.007835 0.252613 1.108971
H  1.216255 1.207705 -1.707239
H  2.201147 2.106399 -0.51418
H  -0.241726 2.823136 -0.450353
H  0.330076 2.161168 1.093489
H  3.167549 -0.434686 -1.646688
H  3.206119 -1.607663 -0.331902
H  -2.639566 2.306315 0.044348
H  -1.464695 -2.55598 -0.020065
H  -3.879509 -1.863509 0.019006
H  5.722341 -0.388732 -1.625621
H  6.549274 0.34219 -0.194281
H  5.944527 -1.346621 -0.144661
H  -5.80869 -0.771598 -0.862594
H  -6.718818 0.485546 0.059009
H  -5.799375 -0.788072 0.947886
