program: Gaussian 09
title: 000290147
version: EM64L-G09RevD.01
frameworkgroup: C1[X(C14H14O2)]
method: RPBEPBE
basis: SDD
operation: Freq
keyword: #pfreq=noraman
keyword: PBEPBE/SDD
title: #p freq=noraman PBEPBE/SDD
converged: YES YES NO NO
title: Mulliken charges:
elementType: O O C C C C C C C C C C C C C C H H H H H H H H H H H H H H
charge: -0.219996 -0.258166 -0.205576 -0.474000 0.325119 -0.568667 -0.566368 0.144218 0.374443 -0.508534 0.104321 -0.350165 -0.554662 0.329675 -0.382850 -0.535742 0.247797 0.224269 0.220403 0.245011 0.245929 0.234205 0.227192 0.261216 0.235737 0.260051 0.246303 0.224812 0.225245 0.248779
chargesum: 0.00000
title: Mulliken charges with hydrogens summed into heavy atoms:
elementType: O O C C C C C C C C C C C C C C
charge: -0.219996 -0.258166 0.042221 -0.029327 0.325119 -0.077727 -0.104971 0.144218 0.374443 -0.247318 0.104321 -0.114428 -0.294611 0.329675 -0.136547 0.163094
polarizability: 2.80091401e+02 -1.21820607e+01 1.56887220e+02 -7.43284258e-01 2.02594337e+00 8.24498299e+01
1716.lowfreq: -5.6989 -0.0009 -0.0008 -0.0003 8.5432 11.1326 51.7649 65.0135 96.8394
frequency: 51.7572 64.9359 96.8237 134.5417 139.4693 186.9341 220.8954 239.1703 248.5463 283.3002 298.6919 360.7992 383.2742 415.8671 443.9077 488.8049 515.3328 527.7806 560.7230 573.7415 581.7426 643.2716 664.3763 708.9217 744.1308 759.1694 815.8991 838.9424 847.4065 867.8484 884.2200 893.5538 912.7171 927.9280 951.0205 990.0031 1002.8073 1036.2339 1061.7152 1097.2136 1111.5242 1122.7982 1134.6753 1144.9138 1167.8781 1183.1290 1187.1735 1214.6083 1224.7318 1234.8539 1250.1976 1269.6601 1274.3137 1294.7802 1325.1401 1328.2832 1352.3855 1380.7644 1434.6039 1436.9721 1442.5152 1452.4058 1467.6931 1470.4228 1472.3705 1487.1702 1563.6625 1592.3459 1618.3920 1626.4842 2948.1790 2957.8613 2965.8864 2988.0181 2999.6218 3033.1843 3051.5341 3056.8863 3074.4143 3130.3002 3138.4251 3146.9914 3170.1554 3178.1444
redmass: 4.1430 3.5823 3.3062 4.3867 4.4409 2.9549 1.2188 2.6666 2.9221 3.2271 6.0967 3.2348 4.0219 4.0985 2.8069 4.0805 4.3300 2.6774 4.2030 4.0426 4.2603 3.2890 2.9859 5.3275 2.9514 3.4647 1.4690 3.5155 2.4477 1.6608 2.6159 1.6661 2.5812 2.0180 1.3684 3.5014 2.9553 1.9521 2.7269 1.8713 1.2588 1.3508 1.5358 1.4617 1.5768 1.5432 1.7861 1.4306 1.7698 2.1282 1.9327 2.3528 1.5336 1.3804 1.6072 1.8192 1.7984 6.3581 1.2422 1.1113 3.2170 1.1411 1.0507 1.0889 1.1129 2.5167 6.6333 7.7819 9.5255 7.8692 1.0819 1.0664 1.0326 1.0613 1.0640 1.0932 1.1037 1.1043 1.0981 1.0997 1.0887 1.0917 1.0948 1.0965
irintensity: 0.1103 5.4690 6.5992 1.7030 1.3259 0.2512 0.5593 2.6482 1.6521 8.1928 0.9257 5.8776 8.1907 2.2003 5.0490 0.5150 4.2481 2.8337 5.3321 2.5128 23.1529 3.3482 5.3319 3.3642 1.3918 2.1550 44.0437 9.2591 2.7867 20.1888 1.6749 8.8170 16.8554 14.4287 1.1823 29.6765 37.4514 1.7768 14.2812 15.0284 0.1832 6.7268 23.0113 16.8616 124.3377 3.9390 72.2042 50.1930 34.6091 60.1964 22.6934 181.3414 1.5036 10.3914 6.7333 24.5504 9.3745 43.5923 17.3249 13.1042 2.9611 12.8988 14.9000 9.9530 68.0246 57.1103 61.3703 570.8892 265.8221 61.3779 12.6121 18.5876 76.8615 30.2860 18.0674 34.4612 37.1329 44.2358 16.7458 25.2152 5.2410 5.1787 12.3209 7.7541
temp: 298.150 k
press: 1.00000 atm
elementType: 8 8 6 6 6 6 6 6 6 6 6 6 6 6 6 6 1 1 1 1 1 1 1 1 1 1 1 1 1 1
symmnumber: 1
zpe: 637435.3 jmol-1
zpe.correction: 0.242786 hartree
zpe.thermalcorrener: 0.256293 hartree
zpe.thermalcorrenthalpy: 0.257237 hartree
zpe.thermalcorrgfe: 0.202614 hartree
zpe.sumelectzpe: -691.182980 hartree
zpe.sumelectthermal: -691.169473 hartree
zpe.sumelectthermalent: -691.168529 hartree
zpe.sumelectthermalfe: -691.223152 hartree
dipole: -5.9203 1.8492 0.3955
dipole: 6.2150
quadrupole: -104.6537 -88.8960 -95.1776
quadrupole: 24.5881 2.1026 -0.0362
quadrupole: -8.4113 7.3464 1.0648 24.5881 2.1026 -0.0362
hfenergy: -691.4257661 hartree
pointgroup: C01 [X(C14H14O2)]
dipole: 2.3449443 -0.6777762 0.1438425 debye
polarizability: 280.561541|-9.5286572|156.4335415|-0.0330396|-1.7032028|82.4333679 unknown
InChI: InChI=1S/C14H14O2/c1-16-12-4-5-13-10(7-12)3-2-9-6-11(15)8-14(9)13/h4-5,7-9H,2-3,6H2,1H3
charge 0 multiplicity 1
30 atoms
O  -4.619355 1.692138 -0.148814
O  4.333011 -0.122045 -0.078868
C  -2.144094 -0.9744 0.399927
C  -1.516771 -2.140173 -0.396027
C  -1.346865 0.311159 0.155081
C  -3.606843 -0.586194 0.076366
C  -0.05006 -2.333051 0.055308
C  0.115811 0.244183 0.110428
C  0.761454 -1.038063 0.049522
C  -2.184939 1.388223 -0.036685
C  -3.596272 0.957421 -0.037402
C  0.921931 1.415327 0.104644
C  2.165441 -1.099385 -0.017983
C  2.950542 0.079297 -0.013874
C  2.324516 1.352997 0.048692
C  5.197858 1.063191 -0.088512
H  -2.060219 -1.226956 1.479367
H  -1.559686 -1.911806 -1.479284
H  -2.087933 -3.072938 -0.231387
H  -4.339204 -0.915145 0.832995
H  -3.931205 -1.005987 -0.895841
H  0.455399 -3.088226 -0.574932
H  -0.050611 -2.743505 1.087573
H  -1.899329 2.427474 -0.215622
H  0.436872 2.396042 0.159221
H  2.682037 -2.0633 -0.078696
H  2.911197 2.275855 0.054664
H  5.076315 1.655089 0.838815
H  4.993061 1.701279 -0.969375
H  6.22234 0.668195 -0.145703
