program: Gaussian 09
title: 000290146
version: EM64L-G09RevD.01
frameworkgroup: C1[X(C11H9N5S)]
method: RPBEPBE
basis: SDD
operation: Freq
keyword: #p
keyword: freq=noraman
keyword: PBEPBE/SDD
title: #p freq=noraman PBEPBE/SDD
converged: YES YES NO NO
title: Mulliken charges:
elementType: S N N N N N C C C C C C C C C C C H H H H H H H H H
charge: 0.130097 -0.079898 -0.237870 0.080471 0.024566 -0.049213 -0.548966 0.516894 -0.165012 -0.202872 0.027368 -0.435566 -0.354101 -0.214755 -0.222688 -0.233889 -0.283271 0.249283 0.265659 0.268612 0.233125 0.253692 0.232850 0.234465 0.235876 0.275141
chargesum: 0.00000
title: Mulliken charges with hydrogens summed into heavy atoms:
elementType: S N N N N N C C C C C C C C C C C
charge: 0.130097 -0.079898 -0.237870 0.080471 0.024566 -0.049213 -0.034024 0.516894 -0.165012 0.065740 0.027368 -0.202440 -0.100409 0.018095 0.011777 0.001987 -0.008130
polarizability: 2.21840767e+02 8.35245472e+00 1.59732107e+02 1.63716070e+01 8.18825119e+00 1.19278558e+02
1716.lowfreq: -10.0453 -5.4737 -2.3310 -0.0014 0.0016 0.0023 17.1568 31.5858 38.7988
frequency: 16.6886 31.5673 38.7879 87.8066 142.7357 200.6097 221.2348 246.4022 260.0214 316.5411 360.4922 403.0072 431.0483 463.9630 516.6777 528.5107 539.2714 589.1973 616.4435 637.4471 650.0172 666.5432 705.3348 730.4853 746.3065 772.3244 814.1210 857.3420 868.5169 892.4210 898.6412 904.5963 924.2898 956.9990 982.1299 990.1687 1002.1748 1003.5577 1026.2910 1083.3930 1106.4288 1128.0296 1148.1593 1175.8643 1189.0150 1190.8836 1209.8425 1218.2489 1222.4903 1297.0185 1328.9422 1344.5825 1358.4140 1371.1726 1382.5199 1390.9946 1444.3701 1465.5320 1484.9435 1509.2377 1547.4143 1595.3090 1614.0441 3005.5664 3070.1769 3116.1157 3127.2671 3138.8384 3151.3563 3168.2589 3174.9264 3255.1947
redmass: 5.0017 4.8344 6.8720 8.0359 8.6612 5.0978 7.2282 4.5721 7.9471 9.0362 2.5221 2.8132 4.1791 5.3436 5.5321 4.6748 5.9738 7.0829 6.3674 5.3898 5.2727 9.0214 2.0601 2.7168 9.4367 2.9871 3.6502 1.2454 1.3849 8.1061 1.4921 3.2448 1.9761 1.9752 1.3993 5.9632 2.6722 1.8682 2.2257 1.8196 3.5114 4.1470 2.6070 1.0567 4.2542 1.3083 2.2485 3.4654 3.6163 2.3339 1.5495 2.1765 1.6319 2.5289 2.6337 2.2886 2.1446 1.1365 2.1799 6.1919 8.9484 6.0662 6.0249 1.0604 1.1027 1.0886 1.0874 1.0908 1.0958 1.1015 1.0935 1.0990
irintensity: 0.1790 0.7031 0.0154 2.0742 0.5516 1.2705 1.2038 2.1156 0.5617 1.9083 2.1430 0.3298 2.2471 3.5803 13.6892 2.6639 9.3884 2.9022 0.4706 14.5838 5.4234 1.6537 32.9610 62.4771 6.7597 6.1136 9.9394 0.1770 17.9774 6.6278 13.1977 11.5742 0.6223 10.7572 0.2995 1.3664 12.8444 10.8207 7.8084 16.8944 28.3593 38.6638 87.3040 0.4089 10.4104 1.7070 61.3008 31.8515 43.0826 3.1902 32.0580 23.6923 49.9530 266.9430 23.7675 105.5863 14.2597 17.5158 13.0616 38.9665 256.1540 1.4607 3.9829 41.6706 16.4608 9.2891 1.2195 6.1804 26.6908 21.3438 0.4193 0.9824
temp: 298.150 k
press: 1.00000 atm
elementType: 16 7 7 7 7 7 6 6 6 6 6 6 6 6 6 6 6 1 1 1 1 1 1 1 1 1
symmnumber: 1
zpe: 496780.8 jmol-1
zpe.correction: 0.189214 hartree
zpe.thermalcorrener: 0.202394 hartree
zpe.thermalcorrenthalpy: 0.203338 hartree
zpe.thermalcorrgfe: 0.146470 hartree
zpe.sumelectzpe: -1095.178611 hartree
zpe.sumelectthermal: -1095.165431 hartree
zpe.sumelectthermalent: -1095.164486 hartree
zpe.sumelectthermalfe: -1095.221355 hartree
dipole: -5.0275 -0.4382 -1.3385
dipole: 5.2211
quadrupole: -100.5088 -123.5823 -96.9409
quadrupole: 7.0222 0.2988 3.8446
quadrupole: 6.5019 -16.5716 10.0698 7.0222 0.2988 3.8446
hfenergy: -1095.3678245 hartree
pointgroup: C01 [X(C11H9N5S1)]
dipole: -1.8720294 -0.7531535 -0.3843643 debye
dipolederiv: -0.3354401 0.1489037 -0.0957597 0.1812612 -0.6130337 0.296326 -0.1286316 0.2253497 -0.2903798 -0.7554439 -0.283986 0.0008077 0.4680169 -0.9828091 0.5234096 -0.3831905 0.1739068 -0.2753187 -0.7803071 0.3783926 -0.5252509 0.4271367 -0.4979337 0.4132864 -0.6225674 0.3771918 -0.271751 -0.7849603 -0.0688982 -0.1577394 0.0319343 -0.4362469 0.0729127 -0.2981528 0.0352885 -0.3041661 -0.2387612 -0.0204303 -0.0234426 0.0622959 -0.2990434 0.0749282 -0.0628901 0.0374229 -0.1849311 -0.7260574 -0.1689298 -0.1465271 -0.1800213 -0.3553154 -0.0316412 -0.2020229 -0.0410103 -0.2896994 0.7336766 0.1035574 -0.0337052 -0.2231676 0.0309825 0.1084996 0.2649965 0.1555054 0.2549901 0.1273364 0.0505686 -0.0937134 0.0347902 0.003902 -0.0282916 -0.2109949 -0.0609315 -0.0435065 0.7773561 -0.1265946 0.3735903 -0.233868 1.3841439 -0.7009563 0.4941859 -0.4939166 0.3376018 0.6678548 -0.1568519 0.2663885 -0.6337392 0.4602209 -0.3385887 0.507994 -0.2421959 0.2754271 0.899075 0.0994889 0.2820475 -0.211813 0.5663635 -0.2406812 0.4472556 -0.0911631 0.3544498 -0.1925166 -0.0135811 -0.0406257 0.0747727 -0.0172739 0.0830679 0.0064305 0.1183491 -0.0192763 -0.088815 0.0578051 0.0112682 0.0842182 -0.0375135 0.0358647 0.0383918 0.0104963 -0.1171294 -0.0046678 0.1263197 -0.0205716 0.1212063 0.0388374 0.0312648 -0.010279 0.0360398 -0.0937268 -0.0967142 0.0016752 -0.0433689 -0.0266131 0.0212415 0.1261124 -0.0551785 0.1266488 0.0123062 -0.0040543 0.0363602 -0.1237003 0.0453843 -0.0894607 0.0138389 -0.1021735 0.0220513 -0.0282473 0.3483869 0.1980037 0.1334596 0.1670572 0.4190925 -0.0750869 0.149414 -0.047113 0.0518999 -0.0086715 -0.0209272 -0.0116688 -0.001385 -0.0139475 -0.1607973 -0.0014217 -0.0578636 0.0250157 0.066769 -0.0054602 0.077994 0.1859007 0.1045806 0.0797387 -0.0089573 -0.0024326 0.0837552 0.065334 -0.0695935 -0.0419808 -0.0745096 0.0668889 0.0097391 -0.0313478 -0.0062953 0.1046188 0.1142043 0.032104 0.0708672 0.0106065 0.0260018 -0.1080769 0.0543133 -0.115569 -0.0012166 0.0774104 -0.0913353 0.0026823 -0.1126128 0.0126614 -0.0235873 -0.0197118 -0.0041119 0.1042565 0.0122894 -0.1163585 0.014517 -0.1348202 -0.013201 -0.0350443 0.0223352 -0.0365377 0.1124742 0.0884299 -0.0081249 0.0434158 0.0137391 0.0155338 -0.1169765 0.0625317 -0.1084975 0.0149597 -0.0226555 -0.0353672 0.121366 -0.0382848 0.109531 -0.0131022 0.1349633 -0.0099879 0.0397108 0.060942 -0.0467402 -0.0403499 -0.0374856 0.0957971 0.0038413 -0.0452921 -0.0006246 0.1478829 unknown
polarizability: 214.2790699|25.2423607|166.688419|12.0263215|-8.0124988|119.883943 unknown
InChI: InChI=1S/C11H9N5S/c17-11-15(6-9-4-2-1-3-5-9)8-13-10-12-7-14-16(10)11/h1-5,7-8H,6H2
charge 0 multiplicity 1
26 atoms
S  0.676608 2.537423 -1.485824
N  0.31585 -0.138178 -0.853776
N  2.301723 0.801528 -0.112833
N  1.843656 -1.543708 0.40689
N  3.302864 1.751412 0.107419
N  3.883054 -0.310393 1.066704
C  -1.010989 -0.128682 -1.558564
C  -2.185319 -0.258725 -0.600524
C  1.102342 1.047142 -0.811344
C  0.711097 -1.335868 -0.248002
C  2.675186 -0.447045 0.480279
C  -3.087115 -1.34478 -0.717123
C  -2.399918 0.717146 0.407313
C  -4.190222 -1.457641 0.160537
C  -3.496889 0.60087 1.286906
C  -4.395168 -0.486502 1.166197
C  4.212561 1.017104 0.814294
H  -1.004081 -0.954016 -2.291997
H  -1.041945 0.82942 -2.107962
H  -0.006825 -2.155972 -0.330948
H  -2.932294 -2.100562 -1.497895
H  -1.71406 1.568278 0.494855
H  -4.883175 -2.300191 0.061083
H  -3.655996 1.358424 2.062018
H  -5.247241 -0.573984 1.84907
H  5.141197 1.468799 1.153429
