program: Gaussian 09
title: 000290144
version: EM64L-G09RevD.01
frameworkgroup: C1[X(C9H6Br3Cl3)]
method: RPBEPBE
basis: SDD
operation: Freq
keyword: #p
keyword: freq=noraman
keyword: PBEPBE/SDD
title: #p freq=noraman PBEPBE/SDD
converged: YES YES NO NO
title: Mulliken charges:
elementType: Br Br Br Cl Cl Cl C C C C C C C C C H H H H H H
charge: 0.016243 0.016286 0.016443 0.026362 0.025758 0.025815 0.776099 0.775863 0.775081 -0.571137 -0.571627 -0.571976 -0.859752 -0.859620 -0.859709 0.306559 0.306679 0.306706 0.306501 0.306738 0.306689
chargesum: 0.00000
title: Mulliken charges with hydrogens summed into heavy atoms:
elementType: Br Br Br Cl Cl Cl C C C C C C C C C
charge: 0.016243 0.016286 0.016443 0.026362 0.025758 0.025815 0.776099 0.775863 0.775081 -0.571137 -0.571627 -0.571976 -0.246513 -0.246414 -0.246282
polarizability: 2.08199943e+02 2.40985981e-03 2.08101862e+02 1.47056265e-01 4.91248461e-02 1.35546907e+02
1716.lowfreq: -4.3021 -0.0024 -0.0022 -0.0016 2.7475 3.9886 26.5859 27.5413 35.3519
frequency: 26.5773 27.5304 35.3450 46.8765 52.5037 52.6196 99.5008 108.2421 108.3788 223.0049 223.3545 223.5425 328.0044 328.5717 332.4333 344.9381 345.0995 345.1571 417.7528 417.8649 524.1175 524.1971 543.0488 572.7621 617.9760 668.2981 668.4805 696.0744 696.5811 804.3123 876.8289 877.1971 909.2088 1012.6463 1012.8933 1075.5072 1125.0152 1126.9522 1138.6890 1219.7797 1221.0354 1225.7106 1317.5726 1358.3659 1379.8014 1380.2252 1450.1858 1450.6559 1456.3579 1554.4756 1555.0230 3088.4790 3088.7995 3089.3850 3173.0227 3173.4641 3173.7640
redmass: 43.6682 43.7180 49.2827 12.1062 27.4218 27.5058 32.2321 23.1100 23.1724 14.6510 21.5735 23.0035 7.0220 7.1903 3.7266 3.2142 4.5907 6.8122 6.4885 6.5320 8.5155 8.5324 6.7020 2.8807 5.4554 6.2233 6.2250 7.8244 7.8444 10.2069 1.5343 1.5343 1.5818 5.5324 5.5442 9.2977 1.1669 1.1671 1.1928 1.1454 1.1451 1.1651 7.3863 6.2199 6.1929 6.1613 1.1119 1.1112 1.1333 9.8800 9.8950 1.0573 1.0573 1.0573 1.1105 1.1105 1.1105
irintensity: 0.0443 0.0456 0.0016 0.0001 0.1694 0.1627 0.0175 1.7380 1.7347 0.4510 0.2915 0.2765 3.5987 3.3409 0.0190 5.6054 3.7395 2.3857 28.1649 28.4397 22.5007 22.3877 50.9659 0.0011 13.6394 1.0695 1.1343 4.8112 4.9058 0.0281 50.8271 51.0092 0.0010 73.6284 73.7126 10.3532 1.2224 1.2957 0.0218 20.6675 20.6506 39.2648 0.2736 0.0024 30.8633 30.4830 30.2562 29.9614 22.3134 87.0788 87.3352 4.4530 6.3326 7.4990 0.2932 0.4539 0.5269
temp: 298.150 k
press: 1.00000 atm
elementType: 35 35 35 17 17 17 6 6 6 6 6 6 6 6 6 1 1 1 1 1 1
symmnumber: 1
zpe: 328459.8 jmol-1
zpe.correction: 0.125104 hartree
zpe.thermalcorrener: 0.141590 hartree
zpe.thermalcorrenthalpy: 0.142534 hartree
zpe.thermalcorrgfe: 0.074903 hartree
zpe.sumelectzpe: -1766.021260 hartree
zpe.sumelectthermal: -1766.004774 hartree
zpe.sumelectthermalent: -1766.003830 hartree
zpe.sumelectthermalfe: -1766.071461 hartree
dipole: -0.0134 -0.0045 -5.0682
dipole: 5.0682
quadrupole: -140.2133 -140.2100 -131.6397
quadrupole: 0.0035 0.0193 0.0069
quadrupole: -2.8590 -2.8557 5.7146 0.0035 0.0193 0.0069
hfenergy: -1766.1463639 hartree
pointgroup: C01 [X(C9H6Br3Cl3)]
dipole: 0.0025525 0.0029778 -1.9939871 debye
dipolederiv: -0.0779867 0.0740853 -0.0238002 0.074589 -0.4313066 0.119359 -0.086433 0.426252 -0.3555351 -0.40812 0.1148974 0.1156224 0.1141663 -0.1009585 -0.0378633 0.4126757 -0.1373234 -0.3556145 -0.2773998 -0.1898771 -0.0908603 -0.1899832 -0.23082 -0.0805535 -0.3259327 -0.2883162 -0.3559617 -0.4632304 -0.3228941 -0.0609312 -0.3228844 -0.3831716 -0.0537953 -0.0143282 -0.012622 -0.0187245 -0.6836908 0.1960398 0.0780816 0.1962006 -0.1637394 -0.0260788 0.019557 -0.0065395 -0.0189769 -0.1237462 0.1271986 -0.0164296 0.127158 -0.7235474 0.0805408 -0.0041519 0.019909 -0.01877 -0.5965898 -0.0738672 -0.0013477 -0.0737344 -0.2476215 0.0111749 0.0255778 -0.1213707 -0.0144091 -0.2707692 -0.113678 0.0107052 -0.1143619 -0.5739177 -0.002749 -0.1172805 0.0403589 -0.0142385 -0.3991756 0.1886834 -0.0074047 0.1885235 -0.4453802 -0.0066345 0.0947854 0.0839681 -0.0136646 0.7377486 0.355813 0.1123541 0.3565332 0.6492899 0.099462 -0.000562 -0.0002088 -0.0875954 0.9807296 -0.2158864 -0.1450126 -0.2169604 0.4072533 0.0480206 -0.0033494 0.0007126 -0.0877671 0.3635926 -0.1404784 0.0300969 -0.1396623 1.0251568 -0.1493717 0.0006222 -0.0030473 -0.087942 0.026861 -0.1181345 0.055185 -0.118012 0.5842391 -0.2733772 0.0932686 -0.4593379 0.5377871 0.5475056 -0.1816911 -0.2647763 -0.1817792 0.0635629 0.087389 -0.4445834 0.1477097 0.5378084 0.3416344 0.2997294 0.2083484 0.2993927 0.2678686 0.1840737 0.349619 0.3091658 0.5381066 0.026661 0.0819681 0.0484919 -0.0056147 0.0743571 0.0713502 0.0347908 0.0806981 -0.0307062 0.0612358 -0.0870344 -0.072696 0.0001454 0.0394599 0.0467612 -0.063541 0.0611172 -0.0308923 0.0288475 0.0041201 0.0375702 -0.0831572 0.0716683 -0.0777596 0.0529746 -0.0703404 -0.0309896 0.0830012 -0.0128934 0.0768695 0.0750131 0.0180969 0.0393848 0.0844038 0.0248352 -0.0303267 0.09545 0.0451118 -0.0858291 -0.0421618 0.005397 0.0065333 -0.0873555 -0.0102695 -0.0308262 0.0074411 -0.0312124 -0.0042374 0.0565898 0.0941128 -0.0858665 -0.0207574 -0.085351 -0.0307617 unknown
polarizability: 208.1728834|0.0436812|208.1286138|-0.1435303|-0.160695|135.5472152 unknown
InChI: InChI=1S/C9H6Br3Cl3/c10-1-4-7(13)5(2-11)9(15)6(3-12)8(4)14/h1-3H2
charge 0 multiplicity 1
21 atoms
Br 0.735726 -3.631829 1.500372
Br -3.515474 1.17016 1.500398
Br 2.772186 2.452285 1.501035
Cl -2.404277 -2.124787 -0.352004
Cl 3.043121 -1.019149 -0.358795
Cl -0.638849 3.145315 -0.358488
C  0.288067 -1.416604 -0.383043
C  -1.370828 0.459477 -0.383118
C  1.083208 0.958281 -0.385119
C  -1.041921 -0.921226 -0.384827
C  1.319278 -0.441338 -0.387327
C  -0.276939 1.363724 -0.387322
C  0.58584 -2.883209 -0.399898
C  -2.789864 0.934558 -0.399973
C  2.20455 1.949243 -0.400992
H  1.559661 -3.112032 -0.850042
H  -0.220598 -3.473594 -0.851963
H  -3.474212 0.207516 -0.854292
H  -2.897176 1.930023 -0.848147
H  1.917614 2.90693 -0.85228
H  3.119885 1.545456 -0.850674
