program: Gaussian 09
title: 000290143
version: EM64L-G09RevD.01
frameworkgroup: C1[X(C17H12ClNO2)]
method: RPBEPBE
basis: SDD
operation: Freq
keyword: #p
keyword: freq=noraman
keyword: PBEPBE/SDD
title: #p freq=noraman PBEPBE/SDD
converged: YES YES NO NO
title: Mulliken charges:
elementType: Cl O O N C C C C C C C C C C C C C C C C C H H H H H H H H H H H H
charge: -0.062568 -0.347186 -0.245191 -0.464298 0.394021 0.382123 -0.602655 0.403201 -0.406746 -0.410308 -0.405855 -0.334924 -0.240071 -0.242410 0.515221 0.233063 -0.437511 -0.358761 -0.043507 -0.189178 -0.255079 0.261483 0.239671 0.239225 0.240939 0.287601 0.229532 0.229587 0.340283 0.254045 0.302582 0.234600 0.259071
chargesum: 0.00000
title: Mulliken charges with hydrogens summed into heavy atoms:
elementType: Cl O O N C C C C C C C C C C C C C C C C C
charge: -0.062568 -0.347186 -0.245191 -0.124015 0.394021 0.382123 -0.341172 0.403201 -0.167075 -0.171082 -0.164916 -0.047323 -0.010539 -0.012823 0.515221 0.233063 -0.183466 -0.056179 -0.043507 0.045422 0.003992
polarizability: 3.98691587e+02 -8.28838036e+00 2.04688852e+02 4.95993862e+00 -4.45011398e+00 8.49235039e+01
1716.lowfreq: -12.2784 -8.8513 -5.3723 -2.2703 0.0012 0.0017 0.0020 19.3214 41.3680
frequency: -11.4091 19.1136 41.3588 60.1669 76.1956 120.4066 149.2350 179.0645 181.8555 184.0791 242.1980 249.4851 283.0181 306.2569 359.8848 398.0573 404.6622 411.7558 438.3017 474.0240 477.0270 512.1555 526.0036 560.2415 595.7991 622.7716 639.2401 645.8032 663.9833 683.7090 692.9255 704.1994 744.2290 758.4050 761.6582 776.4768 789.2933 821.5779 863.3110 864.3923 870.6539 875.2740 906.3006 908.8363 937.3616 956.9849 973.1361 979.0170 985.9219 987.5236 992.0534 1022.6337 1073.9293 1097.4694 1122.1997 1143.8882 1151.9004 1163.4209 1173.5610 1180.7913 1234.5834 1245.1708 1254.1770 1272.7944 1308.9090 1354.7010 1374.5455 1407.9444 1413.0145 1424.2132 1437.9764 1459.1677 1475.6633 1509.7807 1516.0050 1581.3797 1586.6203 1604.7842 1614.0828 1643.0901 1680.3218 3121.6325 3126.8485 3134.6522 3144.1421 3147.0164 3148.7437 3153.0024 3163.3138 3179.3412 3197.7673 3203.8557 3543.5663
redmass: 5.2569 6.9337 6.9964 9.2454 6.1818 6.9330 8.2405 6.3120 4.1496 5.1218 7.6309 4.3791 8.4645 5.4990 6.4581 3.7143 4.6030 6.5488 3.0500 4.5981 3.1599 6.6701 3.6772 4.2954 7.0085 6.4478 2.9179 1.8164 7.1609 2.3032 3.2330 5.9019 7.7844 1.3697 4.4000 2.4415 1.3216 1.3777 1.6190 2.8290 1.9635 5.9691 1.7296 1.3707 5.3649 1.3656 1.4226 5.9000 4.4121 1.3217 1.3469 2.2526 2.0677 1.5474 1.8298 3.6944 1.7455 1.2827 1.0837 1.0874 2.6545 1.5196 1.7420 1.7602 1.5273 1.8010 5.3672 5.3861 3.2677 3.6493 3.4100 2.4484 2.5789 2.6798 2.9532 7.4995 5.2213 5.6462 6.5696 6.9740 9.3939 1.0857 1.0891 1.0907 1.0950 1.0924 1.0892 1.0923 1.1004 1.0955 1.0955 1.0946 1.0762
irintensity: 0.1233 0.0354 0.9273 5.0696 0.2421 2.6918 1.5259 1.5535 0.9462 1.9954 0.5813 2.6671 10.2815 3.0971 4.4413 0.0327 1.0468 8.8595 7.4502 13.0398 19.1730 0.4833 0.6742 3.4620 2.0524 2.1662 3.2556 23.1863 12.2921 33.3110 49.1224 20.0995 41.0490 41.5772 3.9186 1.3483 52.7654 48.2341 34.9192 81.6970 55.8004 4.1981 18.4118 5.6112 1.7259 4.8970 13.6483 15.5317 245.9934 5.2278 0.9598 0.4903 28.9578 92.0736 35.3641 1091.1749 61.2355 59.0129 0.5753 1.2714 154.9560 12.7362 65.0464 9.5866 13.6973 25.2858 152.8845 16.4457 95.4056 8.3759 1.1103 129.6486 96.6982 495.2457 93.4413 5.1904 196.7690 16.3204 170.3482 18.5810 227.2349 3.4979 0.1890 9.7654 32.0250 7.7472 6.2294 7.2334 37.3349 2.5408 5.7516 1.3015 31.4740
temp: 298.150 k
press: 1.00000 atm
elementType: 17 8 8 7 6 6 6 6 6 6 6 6 6 6 6 6 6 6 6 6 6 1 1 1 1 1 1 1 1 1 1 1 1
symmnumber: 1
zpe: 642681.7 jmol-1
zpe.correction: 0.244785 hartree
zpe.thermalcorrener: 0.261112 hartree
zpe.thermalcorrenthalpy: 0.262056 hartree
zpe.thermalcorrgfe: 0.199176 hartree
zpe.sumelectzpe: -1318.854737 hartree
zpe.sumelectthermal: -1318.838409 hartree
zpe.sumelectthermalent: -1318.837465 hartree
zpe.sumelectthermalfe: -1318.900345 hartree
dipole: 1.6830 -0.6516 -0.3277
dipole: 1.8343
quadrupole: -119.5896 -117.3225 -134.4318
quadrupole: -7.2891 -1.5705 -2.7698
quadrupole: 4.1917 6.4588 -10.6505 -7.2891 -1.5705 -2.7698
hfenergy: -1319.0995217 hartree
pointgroup: C01 [X(C17H12Cl1N1O2)]
dipole: -0.6693726 0.0935995 0.2529449 debye
polarizability: 399.0052142|5.5308453|88.5666552|-1.8723507|-20.9754857|200.7320734 unknown
InChI: InChI=1S/C17H12ClNO2/c18-14-6-3-7-15(11-14)19-17(20)21-16-9-8-12-4-1-2-5-13(12)10-16/h1-11,19H
charge 0 multiplicity 1
33 atoms
Cl 7.08626 -0.068221 1.97284
O  -0.105332 0.008683 0.513822
O  0.934768 -0.160421 -1.625699
N  2.12925 -0.05816 0.41855
C  -3.794176 -0.293224 0.736337
C  -4.224181 0.228793 -0.546295
C  -2.394184 -0.367865 1.022309
C  -1.463858 0.060296 0.07652
C  -3.22827 0.657197 -1.48365
C  -4.786836 -0.719557 1.681114
C  -5.62695 0.302601 -0.833824
C  -1.865357 0.58457 -1.192817
C  -6.146006 -0.635122 1.37198
C  -6.570945 -0.120175 0.104594
C  3.484846 -0.118657 -0.000803
C  0.997066 -0.078534 -0.379218
C  4.474804 -0.073537 1.018197
C  3.871613 -0.219243 -1.363693
C  5.828657 -0.128454 0.651584
C  5.243868 -0.271428 -1.685934
C  6.245873 -0.227229 -0.68911
H  -2.045528 -0.756179 1.984722
H  -3.549647 1.05312 -2.454026
H  -4.462786 -1.114257 2.651405
H  -5.948741 0.697282 -1.804979
H  -1.116419 0.900132 -1.919926
H  -6.896177 -0.96362 2.099668
H  -7.640692 -0.060452 -0.12333
H  1.945532 0.010599 1.422002
H  4.19297 0.004122 2.073731
H  3.108426 -0.255613 -2.142748
H  5.541974 -0.349046 -2.736804
H  7.307679 -0.268502 -0.944918
