program: Gaussian 09
title: 000290141
version: EM64L-G09RevD.01
frameworkgroup: C1[X(C13H15P)]
method: RPBEPBE
basis: SDD
operation: Freq
keyword: #pfreq=noraman
keyword: PBEPBE/SDD
title: #p freq=noraman PBEPBE/SDD
converged: YES YES NO NO
title: Mulliken charges:
elementType: P C C C C C C C C C C C C C H H H H H H H H H H H H H H H
charge: 0.595219 -0.886460 0.407448 0.404203 -0.775043 -0.778043 0.496429 -0.788293 -0.787338 -0.377808 -0.378466 -0.221004 -0.228372 -0.241309 0.281077 0.262287 0.257717 0.251444 0.222366 0.231507 0.225643 0.222810 0.225616 0.230685 0.233977 0.236701 0.224537 0.224764 0.227707
chargesum: 0.00000
title: Mulliken charges with hydrogens summed into heavy atoms:
elementType: P C C C C C C C C C C C C C
charge: 0.595219 -0.343095 0.407448 0.404203 -0.517326 -0.526599 0.496429 -0.108778 -0.108228 -0.143832 -0.141764 0.003533 -0.003608 -0.013602
polarizability: 2.37418543e+02 2.97739675e+00 1.55790569e+02 1.81975706e+01 4.51470871e+00 9.83007206e+01
1716.lowfreq: 0.0005 0.0014 0.0016 1.2727 6.3393 11.4775 28.1279 36.3401 56.1962
frequency: 27.5448 35.9600 56.1420 88.2547 110.1804 132.0949 172.6396 217.9932 247.3071 264.1621 293.0393 340.8406 374.1067 403.2959 418.8667 470.9106 492.3547 524.0345 555.6751 616.4281 630.4489 641.7077 702.7696 725.3098 741.5847 764.5892 771.2872 775.6593 802.0803 817.4397 850.7945 867.7784 922.5053 976.5644 985.5763 989.1564 993.9372 999.8725 1026.5805 1032.0714 1045.5296 1067.2772 1093.5578 1125.6905 1154.7178 1171.7790 1186.6112 1194.9906 1201.3532 1218.6645 1325.2018 1355.9342 1382.5143 1389.2885 1400.6099 1438.9601 1447.1941 1455.2447 1460.1665 1468.5281 1472.4445 1482.3302 1520.8203 1591.6328 1595.3917 1611.6978 2968.1266 2970.1353 3018.4441 3041.2540 3043.1817 3087.7722 3090.3967 3094.5390 3118.1734 3120.0016 3133.9548 3144.6906 3162.6291 3178.7740 3186.9548
redmass: 4.3934 3.8184 3.8403 3.6937 2.2855 1.4168 1.0635 4.0021 3.0194 2.5452 3.8268 2.1332 3.1433 2.8202 3.6046 4.0560 5.8982 4.2112 5.1999 6.2900 4.1105 3.3070 1.7150 4.2421 1.4977 2.2809 2.9813 2.3915 3.3546 1.4167 1.2849 1.5449 1.4461 1.3863 1.4008 5.8654 1.3233 1.6238 2.2007 1.4434 1.6283 1.5087 2.1484 1.1092 1.4541 1.0507 1.1237 1.4842 1.3092 3.3229 1.2773 3.5134 8.4489 1.2404 1.2687 2.0894 1.1463 1.0943 1.0481 1.2679 1.0453 2.3259 3.5198 6.0750 6.3260 6.1168 1.0380 1.0374 1.0584 1.0968 1.0970 1.0981 1.0978 1.1056 1.0850 1.0878 1.0917 1.0962 1.1016 1.0937 1.0946
irintensity: 0.1586 0.1256 0.4263 1.3214 0.5333 0.3120 1.2907 0.8168 0.9366 0.9542 14.0840 1.7013 0.6849 0.0052 1.8485 7.3889 7.2572 2.4089 4.0815 0.2211 4.5122 2.5039 53.2755 4.3345 0.6148 12.2616 23.9579 26.5419 1.4284 55.1821 2.5876 19.2710 2.2543 0.2073 25.8682 0.0312 0.0967 0.0289 7.6540 15.2172 0.2812 9.8782 7.8479 2.3973 2.4789 0.0635 0.8039 0.6927 1.8305 0.6264 0.4190 18.1383 0.0499 10.6287 16.7156 6.9458 7.2285 28.3041 0.0619 5.3624 31.2327 23.7332 0.4192 1.3024 1.0147 12.7202 7.7678 73.1906 15.3705 0.1424 44.0275 38.2066 3.2281 3.9886 9.1317 1.1486 15.1367 42.4015 25.9558 10.0596 2.9595
temp: 298.150 k
press: 1.00000 atm
elementType: 15 6 6 6 6 6 6 6 6 6 6 6 6 6 1 1 1 1 1 1 1 1 1 1 1 1 1 1 1
symmnumber: 1
zpe: 622516.9 jmol-1
zpe.correction: 0.237104 hartree
zpe.thermalcorrener: 0.251254 hartree
zpe.thermalcorrenthalpy: 0.252198 hartree
zpe.thermalcorrgfe: 0.194733 hartree
zpe.sumelectzpe: -844.577567 hartree
zpe.sumelectthermal: -844.563417 hartree
zpe.sumelectthermalent: -844.562473 hartree
zpe.sumelectthermalfe: -844.619938 hartree
dipole: 0.8583 0.7539 1.1071
dipole: 1.5908
quadrupole: -80.3440 -83.8746 -95.9982
quadrupole: 1.0469 4.6240 -0.7737
quadrupole: 6.3949 2.8643 -9.2593 1.0469 4.6240 -0.7737
hfenergy: -844.814671 hartree
pointgroup: C01 [X(C13H15P1)]
dipole: -0.3364021 0.2872556 -0.4427671 debye
polarizability: 237.0698474|-1.7420689|155.6178512|19.7575544|-5.0230394|98.8221336 unknown
InChI: InChI=1S/C13H15P/c1-11-8-14(9-12(11)2)10-13-6-4-3-5-7-13/h3-9H,10H2,1-2H3
charge 0 multiplicity 1
29 atoms
P  -0.792136 -1.104287 0.716912
C  0.465702 -1.173376 -0.773084
C  -2.645084 0.801002 0.287999
C  -3.256173 -0.479008 -0.172295
C  -1.335847 0.670003 0.700572
C  -2.398382 -1.556363 -0.098948
C  1.773576 -0.492463 -0.436414
C  -3.426087 2.097967 0.294673
C  -4.688593 -0.547588 -0.657272
C  2.797379 -1.182653 0.26506
C  1.999078 0.859404 -0.806947
C  4.015195 -0.541355 0.583159
C  3.216608 1.503125 -0.491381
C  4.230346 0.804612 0.205114
H  -0.034567 -0.706864 -1.637477
H  0.610132 -2.248295 -0.98091
H  -0.716318 1.482985 1.084971
H  -2.661653 -2.580389 -0.374493
H  -3.795198 2.351207 -0.718143
H  -2.805191 2.936806 0.651003
H  -4.31543 2.029959 0.950946
H  -4.855604 0.131591 -1.515678
H  -5.398175 -0.240651 0.135621
H  -4.955534 -1.56954 -0.974359
H  2.636011 -2.225778 0.563887
H  1.214145 1.404953 -1.345127
H  4.795475 -1.090358 1.122625
H  3.375429 2.545471 -0.790731
H  5.175695 1.30188 0.449519
