program: Gaussian 09
title: 000290140
version: EM64L-G09RevD.01
frameworkgroup: C1[X(C6H9O3P)]
method: RPBEPBE
basis: SDD
operation: Freq
keyword: #pfreq=noraman
keyword: PBEPBE/SDD
title: #p freq=noraman PBEPBE/SDD
converged: YES YES NO NO
title: Mulliken charges:
elementType: P O O O C C C C C C H H H H H H H H H
charge: 1.054646 -0.636227 -0.425249 -0.235972 -0.738651 -0.411379 -0.140440 -0.232061 -0.901705 0.144263 0.258855 0.298643 0.240128 0.254164 0.283396 0.234411 0.270852 0.292606 0.389722
chargesum: 0.00000
title: Mulliken charges with hydrogens summed into heavy atoms:
elementType: P O O O C C C C C C
charge: 1.054646 -0.636227 -0.035527 -0.235972 -0.181154 0.082913 -0.140440 0.051335 -0.103835 0.144263
polarizability: 1.04303472e+02 -6.35756637e+00 1.10638859e+02 -7.80703108e-01 1.56564027e+00 7.12752885e+01
1716.lowfreq: -21.9350 -15.8803 -11.5804 -5.2228 -0.0019 -0.0012 0.0008 57.2820 125.0052
frequency: -21.1000 57.2571 125.0004 134.1701 144.7317 195.3266 210.8851 242.4780 261.9232 346.8095 415.3785 425.6576 500.6604 591.6173 606.8943 629.9131 671.9524 719.1678 721.7735 760.0061 870.4426 903.4739 908.7408 931.5967 967.5718 989.9150 1030.0205 1060.8187 1104.1915 1138.2489 1205.9606 1217.3403 1271.7428 1295.5416 1309.4599 1321.6891 1429.8629 1431.8220 1447.1771 1450.1181 1625.8950 1645.1471 2983.1006 3007.6881 3025.3770 3041.8867 3114.8637 3127.1500 3130.0543 3137.9039 3531.2821
redmass: 2.2356 9.5285 4.4567 3.6244 1.1294 2.5289 2.6351 4.9940 5.6026 7.1278 7.1518 3.6333 5.6400 2.5159 1.9169 3.8204 3.4006 3.9674 3.7963 1.6998 1.5014 2.2653 1.8372 1.4227 1.8916 4.6782 3.5040 2.2115 2.0769 1.1855 1.2832 1.1262 1.5036 2.0637 1.8239 1.2533 1.0492 1.0785 1.0659 1.0798 7.6828 8.6170 1.0604 1.0313 1.0999 1.0596 1.1053 1.1023 1.0939 1.1014 1.0642
irintensity: 1.2652 3.5878 6.9180 0.6932 0.3539 2.0160 0.8413 6.8247 4.8504 20.6981 28.5335 19.3646 5.0677 60.0623 70.1082 16.7876 19.5770 69.9087 8.6750 26.8647 3.0364 18.5977 5.8032 49.9557 5.2389 101.3961 133.9988 11.3607 148.3401 2.2454 13.7139 2.7145 16.8065 36.9567 37.3400 20.0720 6.9412 14.5740 16.7297 29.9398 116.8928 254.6113 17.5173 6.5228 7.1665 11.3016 5.1706 8.8156 3.2536 1.5825 46.1389
temp: 298.150 k
press: 1.00000 atm
elementType: 15 8 8 8 6 6 6 6 6 6 1 1 1 1 1 1 1 1 1
symmnumber: 1
zpe: 373340.7 jmol-1
zpe.correction: 0.142198 hartree
zpe.thermalcorrener: 0.152509 hartree
zpe.thermalcorrenthalpy: 0.153453 hartree
zpe.thermalcorrgfe: 0.106232 hartree
zpe.sumelectzpe: -800.144323 hartree
zpe.sumelectthermal: -800.134013 hartree
zpe.sumelectthermalent: -800.133069 hartree
zpe.sumelectthermalfe: -800.180289 hartree
dipole: -1.6008 2.4186 4.1932
dipole: 5.0986
quadrupole: -64.3125 -64.1877 -71.4726
quadrupole: -12.1426 -4.0277 -6.6260
quadrupole: 2.3451 2.4699 -4.8150 -12.1426 -4.0277 -6.6260
hfenergy: -800.2865213 hartree
pointgroup: C01 [X(C6H9O3P1)]
dipole: 0.7076624 -1.1692191 1.4683098 debye
dipolederiv: 1.141516 0.2081375 0.0097706 0.0994983 1.3402401 0.016507 0.01454 0.0455836 1.2571096 -0.5972444 -0.0600874 0.0048068 -0.03075 -0.6996772 0.0260298 -0.0030514 0.0561526 -0.6814745 -0.3757648 0.2089782 0.0553563 0.221894 -1.1348206 -0.166078 0.0495106 -0.1906722 -0.4315688 -1.1198003 -0.2506555 -0.0415764 -0.1544447 -0.6306642 -0.0776764 -0.0164276 -0.0727882 -0.3321256 -0.2403763 0.0367437 0.008886 0.0785751 -0.2947883 0.0137711 0.0120539 -0.0180731 -0.1143678 -0.1463687 0.1751968 0.0115968 0.1736996 -0.0517543 -0.0283762 0.0358169 -0.0124811 0.1209725 -0.668329 0.2337581 0.0718297 0.4077469 -0.5557736 -0.0534872 0.1179316 -0.0384359 -0.306371 0.2082655 -0.3041627 -0.0337271 -0.2939612 0.2678732 0.0269644 -0.0493593 0.0609027 -0.1026482 -0.2225505 -0.0291265 -0.0083271 -0.0156369 -0.2479878 -0.0837646 -0.0166524 -0.1177938 -0.3658296 1.6595437 -0.1548376 -0.0414938 -0.2556509 1.370818 0.2825137 -0.0506765 0.2709502 0.3160675 -0.0144835 -0.0190135 -0.0992829 0.0086163 0.0655566 0.009683 -0.1238057 -0.0051524 -0.0162143 0.0324335 -0.0216892 0.0709164 -0.0121619 0.0646605 -0.0109436 0.0801593 0.0167561 0.0040766 0.0360184 0.0492918 -0.0294757 -0.0194791 0.0031718 0.0842682 -0.0500418 0.1232804 -0.0010931 0.0390846 0.0320284 0.0280513 -0.0350373 0.0224673 -0.081954 0.0379893 -0.1195066 -0.0209795 0.0187305 -0.0694766 0.006813 -0.0870627 0.016638 -0.010081 -0.0134328 -0.0218744 0.1816075 0.1031497 0.0101025 -0.0184618 0.0136532 -0.004426 0.0915564 -0.0154204 0.077363 -0.0630724 -0.009027 -0.1011154 -0.0166608 -0.0934902 0.0463527 -0.0108554 -0.0220103 -0.0348201 0.0798748 0.0389205 0.0851744 0.0337267 0.0820898 0.0761548 -0.0167656 0.0410257 -0.0208622 0.0906098 0.116282 -0.029247 -0.012748 -0.0880983 0.3459591 -0.0113118 -0.028149 0.0014713 0.3854265 unknown
polarizability: 104.2310899|-6.2097078|110.2918874|-1.7760173|4.202692|71.6946422 unknown
InChI: InChI=1S/C6H9O3P/c1-10(9)4-2-3-5(10)6(7)8/h3,7H,2,4H2,1H3
charge 0 multiplicity 1
19 atoms
P  1.039415 0.756062 -0.114856
O  1.091968 1.790351 -1.351884
O  -1.963844 1.300177 0.380827
O  -2.820824 -0.820267 -0.054161
C  2.292571 -0.686752 -0.191961
C  1.490444 -2.018892 -0.216614
C  -0.40568 -0.443471 -0.0137
C  0.004107 -1.737931 -0.115996
C  1.174602 1.584061 1.562661
C  -1.829864 -0.06438 0.084384
H  2.973337 -0.627627 0.672588
H  2.881106 -0.534601 -1.110807
H  1.789826 -2.682913 0.618616
H  1.689289 -2.595915 -1.141235
H  -0.717768 -2.565657 -0.13125
H  1.249283 0.833912 2.367112
H  2.063417 2.235744 1.564237
H  0.270799 2.196562 1.705689
H  -2.927484 1.546437 0.397051
