program: Gaussian 09
title: 000290136
version: EM64L-G09RevD.01
frameworkgroup: C1[X(C12H14Br3OP)]
method: RPBEPBE
basis: SDD
operation: Freq
keyword: #p
keyword: freq=noraman
keyword: PBEPBE/SDD
title: #p freq=noraman PBEPBE/SDD
converged: YES YES NO NO
title: Mulliken charges:
elementType: Br Br Br P O C C C C C C C C C C C C H H H H H H H H H H H H H H
charge: -0.007708 0.031888 0.007523 1.089385 -0.652148 -0.707639 -0.691568 -0.431222 -0.456127 -0.750186 -0.521904 0.512200 -0.400745 -0.394792 -0.182080 -0.184841 -0.213879 0.294747 0.321894 0.320856 0.279097 0.357594 0.351333 0.288456 0.272214 0.262959 0.217354 0.249223 0.236290 0.251416 0.250412
chargesum: 0.00000
title: Mulliken charges with hydrogens summed into heavy atoms:
elementType: Br Br Br P O C C C C C C C C C C C C
charge: -0.007708 0.031888 0.007523 1.089385 -0.652148 -0.090998 -0.091615 -0.073628 -0.104793 -0.189517 -0.041592 0.512200 -0.151521 -0.158502 0.069337 0.065571 -0.213879
polarizability: 2.97206977e+02 4.15929408e+01 1.81679974e+02 -7.68185925e+00 1.94947634e+01 1.37774526e+02
1716.lowfreq: -10.2542 -8.0531 -3.0150 0.0008 0.0012 0.0015 6.4397 11.3196 19.5500
frequency: -3.4007 10.3026 19.3870 37.0732 44.5059 66.2751 88.3072 116.4701 145.6826 156.2711 180.7814 196.1257 209.8530 248.6661 263.2524 291.1748 312.8124 337.3393 350.7361 358.3309 405.6610 485.8095 500.5810 509.8290 566.1793 584.7608 608.0166 625.5947 642.6430 682.5023 728.7259 752.3513 778.4244 799.7311 834.0411 838.7077 845.6393 865.1345 875.8868 945.1297 954.6950 971.5222 978.5134 995.5488 1006.6281 1013.3880 1060.4460 1070.4356 1095.8833 1111.9832 1123.9888 1139.0040 1160.2912 1176.2711 1186.8840 1203.6154 1215.7271 1225.4092 1236.2504 1272.4491 1277.9832 1299.4542 1300.2227 1331.1415 1373.1482 1392.5794 1411.0856 1416.2029 1424.5994 1472.2977 1484.2064 1581.2282 1597.1574 2989.0790 3010.3766 3027.6229 3032.5723 3048.1572 3084.9090 3110.3515 3118.5157 3121.7240 3125.2502 3126.6376 3130.7944 3167.9215 3170.9519
redmass: 4.7361 8.5797 14.6025 4.6069 10.5751 10.3036 6.4235 7.1434 8.4587 5.3561 12.3475 4.2035 5.1342 5.5958 4.7582 3.0273 3.2661 3.7444 4.2676 2.6779 2.8789 6.3096 4.1726 3.2772 3.3339 7.0370 5.5398 6.9116 4.4848 3.8310 3.2265 1.9184 2.1430 2.7598 1.2713 1.6088 1.8447 2.4024 2.9862 1.9487 1.3787 1.3761 2.1750 5.0862 3.8208 4.2626 2.5734 1.6086 1.3080 1.0934 1.0926 1.1271 1.1550 1.7653 1.1115 1.2387 2.6566 1.4348 1.2569 1.2401 1.4066 1.3582 1.3214 1.3787 6.5205 2.5377 1.0779 1.0793 1.0782 2.3970 1.1049 7.1604 6.2327 1.0607 1.0578 1.0631 1.0615 1.1014 1.1048 1.0876 1.0920 1.1002 1.0899 1.0999 1.0901 1.0948 1.0959
irintensity: 0.2273 0.1974 0.0789 0.2942 0.7219 0.8865 6.0817 1.8357 7.7039 5.7261 1.1748 3.9057 0.9904 15.2313 10.9134 8.7276 0.5381 3.9530 0.8260 0.0377 0.0040 10.1895 51.2417 41.1497 11.5056 14.7491 42.0489 0.3039 4.6497 5.8783 5.0288 10.4412 12.4865 30.0216 0.9929 11.4217 34.1462 68.3925 21.7840 20.0759 1.2786 0.1764 17.9020 63.1843 62.3673 10.7432 31.0621 25.3825 0.8670 3.8654 6.3370 19.8563 20.4493 44.4505 0.4627 13.8811 1.2621 2.1704 19.8725 0.2660 2.2409 2.4586 2.1798 3.6456 0.1935 5.8560 35.2322 5.9406 2.7178 98.0765 6.5425 0.0658 5.7410 13.6043 9.0663 4.4980 0.3924 6.7903 7.3687 0.1321 2.9576 0.6756 12.7965 0.6700 8.8216 8.6849 0.3061
temp: 298.150 k
press: 1.00000 atm
elementType: 35 35 35 15 8 6 6 6 6 6 6 6 6 6 6 6 6 1 1 1 1 1 1 1 1 1 1 1 1 1 1
symmnumber: 1
zpe: 604914.5 jmol-1
zpe.correction: 0.230400 hartree
zpe.thermalcorrener: 0.248120 hartree
zpe.thermalcorrenthalpy: 0.249064 hartree
zpe.thermalcorrgfe: 0.178981 hartree
zpe.sumelectzpe: -921.230297 hartree
zpe.sumelectthermal: -921.212576 hartree
zpe.sumelectthermalent: -921.211632 hartree
zpe.sumelectthermalfe: -921.281715 hartree
dipole: -1.1591 3.0464 0.8869
dipole: 3.3780
quadrupole: -154.6909 -154.1844 -129.0370
quadrupole: -10.3899 -1.0006 0.4955
quadrupole: -8.7201 -8.2136 16.9337 -10.3899 -1.0006 0.4955
hfenergy: -921.4606963 hartree
pointgroup: C01 [X(C12H14Br3O1P1)]
dipole: 0.4763998 1.227957 -0.1772854 debye
polarizability: 294.1587525|-42.65293|188.3563621|-20.2325756|-9.9870572|134.1463619 unknown
InChI: InChI=1S/C12H14Br3OP/c13-10-3-1-9(2-4-10)5-6-17(16)7-11(14)12(15)8-17/h1-4,11-12H,5-8H2
charge 0 multiplicity 1
31 atoms
Br 2.85863 2.867189 0.572819
Br 5.746939 -0.694958 -0.637125
Br -6.603364 0.826023 0.428918
P  2.085574 -0.867663 0.282572
O  2.108599 -2.4806 0.373099
C  3.186041 0.076469 1.528242
C  2.918652 -0.072751 -1.247181
C  3.96402 1.122889 0.719395
C  4.179322 0.633685 -0.727361
C  0.329104 -0.173024 0.388688
C  -0.617782 -0.922129 -0.587018
C  -2.067969 -0.516308 -0.36742
C  -2.883553 -1.221699 0.553842
C  -2.627999 0.593894 -1.048633
C  -4.220515 -0.833613 0.797191
C  -3.962924 0.998716 -0.821739
C  -4.74345 0.277159 0.104199
H  2.592178 0.518908 2.3413
H  3.881635 -0.669584 1.953287
H  3.13546 -0.853248 -1.99056
H  2.234031 0.673028 -1.689183
H  4.890012 1.467607 1.20057
H  4.558852 1.42219 -1.392039
H  -0.010522 -0.321232 1.430599
H  0.364014 0.912837 0.190472
H  -0.487198 -2.008891 -0.428242
H  -0.318025 -0.70813 -1.631298
H  -2.476249 -2.090684 1.084399
H  -2.020757 1.150704 -1.77291
H  -4.840891 -1.389046 1.50635
H  -4.384667 1.853461 -1.358232
