program: Gaussian 09
title: 000290134
version: EM64L-G09RevD.01
frameworkgroup: C1[X(C11H11ClO)]
method: RPBEPBE
basis: SDD
operation: Freq
keyword: #p
keyword: freq=noraman
keyword: PBEPBE/SDD
title: #p freq=noraman PBEPBE/SDD
converged: YES YES NO NO
title: Mulliken charges:
elementType: Cl O C C C C C C C C C C C H H H H H H H H H H H
charge: -0.043694 -0.233756 0.499174 -0.490565 0.193617 -0.267265 -0.307831 -0.363570 -0.376685 -0.677140 -0.216684 -0.222044 -0.109028 0.229352 0.229277 0.270079 0.218234 0.234541 0.245409 0.230849 0.231088 0.208745 0.257834 0.260062
chargesum: 0.00000
title: Mulliken charges with hydrogens summed into heavy atoms:
elementType: Cl O C C C C C C C C C C C
charge: -0.043694 -0.233756 0.499174 -0.031936 0.193617 0.002814 -0.089597 -0.129029 -0.131277 -0.006457 0.041150 0.038019 -0.109028
polarizability: 2.74246239e+02 1.39164780e+00 1.21395069e+02 1.42373477e-02 1.09711261e-02 6.02909951e+01
1716.lowfreq: -5.5673 -3.0233 0.0013 0.0015 0.0026 7.7758 31.7374 47.1536 61.2270
frequency: 31.5067 47.1497 61.2225 64.5309 126.2551 177.4169 178.8818 196.6392 221.3845 266.3398 327.5794 342.6475 404.8250 410.4224 485.7047 491.7019 545.8320 612.3896 626.0778 673.6737 713.0135 785.1594 804.8369 825.9025 830.7277 888.5029 896.7429 956.5780 968.3643 997.9080 1008.3701 1015.6233 1045.6422 1066.7236 1074.2808 1110.1243 1129.0843 1187.8533 1216.8255 1237.5921 1288.1822 1295.4667 1314.4440 1339.6096 1377.2698 1396.5175 1403.9209 1431.9776 1469.1298 1477.7675 1478.7378 1565.0491 1572.9932 1597.6656 1649.1221 2956.7724 2997.4759 3000.4506 3093.7460 3093.9700 3099.3815 3114.4824 3138.7171 3145.9232 3171.4284 3174.6887
redmass: 4.1019 2.1863 6.7606 5.1165 2.2709 3.8318 5.7052 1.2592 7.5166 4.7731 4.6447 3.8162 8.0541 2.8425 2.5054 4.3876 2.3372 5.5200 7.0518 4.5202 3.1754 1.4093 5.0232 1.2698 1.4913 1.7355 3.4066 1.3493 1.3741 3.9887 1.9822 1.1857 2.3954 1.6705 2.7722 1.3929 2.2733 1.1268 1.6264 1.1923 1.8897 1.3758 1.3521 2.3116 4.4465 1.2139 3.3932 1.0990 1.0393 1.0538 2.4364 7.6784 7.0424 6.1307 5.7298 1.0603 1.0362 1.0975 1.0903 1.1001 1.0996 1.0902 1.0899 1.0886 1.0959 1.0968
irintensity: 0.1763 2.8954 1.6283 1.0914 0.0733 0.1166 1.0569 0.9750 1.2187 4.8321 15.0059 0.0255 14.0140 0.0046 18.3271 8.0186 8.1634 0.3257 0.4885 7.3677 0.7789 0.0030 31.3500 0.5345 88.9093 2.9220 2.4832 2.1972 0.0921 39.2655 13.3760 41.7278 114.0668 1.2862 52.3652 10.2032 116.9324 7.6633 21.1022 0.0695 23.7774 10.3135 6.5047 61.8404 59.0105 28.2063 22.5802 23.1162 11.9821 18.4214 119.8753 303.9917 12.4426 20.5148 126.2020 38.9021 32.6826 13.2185 0.3143 31.6156 31.6523 14.8799 6.4473 5.2666 6.6590 1.4335
temp: 298.150 k
press: 1.00000 atm
elementType: 17 8 6 6 6 6 6 6 6 6 6 6 6 1 1 1 1 1 1 1 1 1 1 1
symmnumber: 1
zpe: 488656.1 jmol-1
zpe.correction: 0.186119 hartree
zpe.thermalcorrener: 0.199155 hartree
zpe.thermalcorrenthalpy: 0.200099 hartree
zpe.thermalcorrgfe: 0.144618 hartree
zpe.sumelectzpe: -960.102283 hartree
zpe.sumelectthermal: -960.089247 hartree
zpe.sumelectthermalent: -960.088303 hartree
zpe.sumelectthermalfe: -960.143785 hartree
dipole: 0.4071 -2.3790 0.0017
dipole: 2.4136
quadrupole: -94.9202 -77.5937 -86.7953
quadrupole: 13.1599 -0.0032 0.0075
quadrupole: -8.4838 8.8427 -0.3589 13.1599 -0.0032 0.0075
hfenergy: -960.2884023 hartree
pointgroup: C01 [X(C11H11Cl1O1)]
dipole: -0.1518862 -0.9373177 0.0072901 debye
dipolederiv: -1.065157 -0.1068949 0.0158057 -0.1490909 -0.1368082 0.0027392 0.0161525 0.0021239 -0.0614929 -0.9858242 -0.0252216 0.0104566 -0.5956 -0.7654464 0.0115309 0.0135471 0.002982 -0.3022905 -0.3211192 -0.0434306 0.0054482 -0.1261368 -0.0851364 0.0025281 0.0061777 0.0012728 0.0205582 -0.1975303 0.1534439 0.0044783 0.4366035 -0.2537458 -0.0039595 0.0018304 0.0006793 0.159185 2.2432917 -0.1668964 -0.0309362 0.3249615 0.8025693 -0.0087526 -0.0335898 -0.0015126 0.1155768 0.9620356 0.0280889 -0.0153846 -0.1522157 0.1285157 0.0011511 -0.0141674 -0.0015332 -0.0644384 -1.6589436 0.0506459 0.0210603 0.3922355 0.0498043 -0.0076213 0.0190458 -0.0025285 -0.2297599 0.1070204 -0.0455773 -0.0032379 0.162318 0.0520851 -0.0034132 -0.0046212 -0.0002217 -0.1227705 0.1529615 0.0954285 -0.005124 -0.1370511 0.0828343 0.000482 -0.0038551 -0.0030112 -0.1488776 -0.0755681 -0.0333895 0.0023903 -0.0269609 0.0660785 0.0002309 0.0025117 0.0001438 0.0577653 -0.5211096 0.049558 0.0059918 0.1754475 0.0250703 -0.0034581 0.0051627 -0.0015495 -0.1013106 -0.371902 -0.1634053 0.0051802 -0.3016972 -0.0550925 0.0042601 0.0061579 0.0021703 -0.0990228 1.4338288 0.1664451 -0.0237275 0.1641172 0.1883414 -0.0041438 -0.0239379 -0.0041904 -0.0667467 -0.030522 -0.0161587 0.0697893 -0.0734612 0.0351464 0.0913319 0.0661044 0.113815 -0.0379058 -0.0347243 -0.0209907 -0.0697224 -0.0774592 0.0322353 -0.0899626 -0.0650624 -0.1142872 -0.0308096 0.0865385 -0.0083755 0.0008985 -0.0307929 -0.0286427 0.0014947 0.00101 0.0011847 0.1448816 0.0761893 -0.0377612 0.0014596 -0.053029 -0.100049 0.0023507 0.0017171 0.0020652 0.1578725 0.0127664 0.1007446 0.0013634 0.0690127 -0.0058627 -0.0001363 0.0015567 -0.0006617 0.1428591 0.0483697 -0.0846426 0.0021261 -0.0532397 -0.0413935 0.002082 0.0018441 0.0025889 0.1548236 0.0839141 -0.0111643 0.0084498 -0.070242 0.0340694 0.1106615 0.0409091 0.0974725 -0.0654263 0.0829795 -0.0143506 -0.0127361 -0.0746204 0.0306289 -0.1099456 -0.0440379 -0.0984835 -0.0597787 -0.1053247 0.1128303 0.0023048 0.1839894 -0.0605107 -0.0013581 0.0017215 -0.0002757 0.1041894 0.0584732 -0.052433 0.0019342 -0.0604173 -0.0183034 0.0020769 0.0020226 0.0019378 0.165255 0.0193563 0.0735069 0.0017317 0.0733291 0.0236125 -0.0001689 0.0018003 -0.0001809 0.1676639 unknown
polarizability: 274.2109547|-0.0627879|121.380041|-3.2021482|-0.3805176|60.3413068 unknown
InChI: InChI=1S/C11H11ClO/c1-2-11(13)8-5-9-3-6-10(12)7-4-9/h3-8H,2H2,1H3
charge 0 multiplicity 1
24 atoms
Cl -5.405873 -0.451633 0.056698
O  3.388525 1.344533 -0.085158
C  -0.814193 0.26608 -0.016922
C  4.142255 -0.987776 -0.083381
C  3.078559 0.114239 -0.073754
C  0.624827 0.551134 -0.039516
C  1.660598 -0.345171 -0.049591
C  -1.35028 -1.055812 -0.000467
C  -1.727601 1.36015 -0.010188
C  5.584722 -0.458895 -0.110378
C  -2.739398 -1.278362 0.021751
C  -3.122283 1.15588 0.011657
C  -3.608345 -0.165796 0.027597
H  3.972848 -1.631563 0.805971
H  3.944278 -1.643703 -0.957797
H  0.917123 1.612369 -0.050054
H  1.490425 -1.429954 -0.040507
H  -0.678353 -1.920278 -0.005373
H  -1.336851 2.384259 -0.022662
H  5.757459 0.163075 -1.005357
H  5.784792 0.178874 0.767617
H  6.309082 -1.292738 -0.11422
H  -3.145095 -2.293965 0.034324
H  -3.814521 2.002355 0.016511
