program: Gaussian 09
title: 000290133
version: EM64L-G09RevD.01
frameworkgroup: C1[X(C11H11NO3)]
method: RPBEPBE
basis: SDD
operation: Freq
keyword: #p
keyword: freq=noraman
keyword: PBEPBE/SDD
title: #p freq=noraman PBEPBE/SDD
converged: YES YES NO NO
title: Mulliken charges:
elementType: O O O N C C C C C C C C C C C H H H H H H H H H H H
charge: -0.223164 -0.206412 -0.205103 0.027534 0.514874 -0.491093 -0.267378 -0.353221 -0.369733 0.377346 0.196217 -0.367225 -0.370522 -0.296498 -0.675127 0.232366 0.232393 0.276401 0.239377 0.251940 0.288384 0.290303 0.222341 0.231955 0.231949 0.212096
chargesum: 0.00000
title: Mulliken charges with hydrogens summed into heavy atoms:
elementType: O O O N C C C C C C C C C C C
charge: -0.223164 -0.206412 -0.205103 0.027534 0.514874 -0.026334 0.009023 -0.113844 -0.117793 0.377346 0.196217 -0.078841 -0.080219 -0.074157 0.000873
polarizability: 3.01675292e+02 2.60086358e+00 1.37393457e+02 2.83046517e-02 2.21541327e-02 6.25571460e+01
1716.lowfreq: -4.4019 -4.0165 -2.4625 -0.0012 -0.0006 0.0004 27.9097 44.0670 58.4887
frequency: 27.7841 44.0464 58.4813 62.1141 67.4513 124.1638 165.9341 170.7262 195.5177 209.9185 249.9687 316.6991 322.4030 399.8386 410.3233 475.2559 477.8686 518.7140 541.8438 607.4320 627.4262 664.5071 665.0950 735.5551 765.2982 787.9298 818.5185 845.1408 855.9006 896.4166 898.4861 989.2090 996.5932 1002.2172 1008.2043 1018.3804 1045.2683 1067.3201 1093.3394 1111.2132 1127.1837 1183.4268 1213.0961 1222.7423 1236.7633 1287.5792 1296.1755 1318.4564 1339.8652 1364.2054 1398.0399 1403.1598 1420.9877 1430.0462 1469.6663 1477.5591 1482.5520 1567.9119 1585.8647 1606.8787 1649.9021 2956.1909 2999.2215 2999.3865 3096.4963 3097.3986 3100.5066 3117.3181 3146.0838 3154.0400 3183.8616 3186.4034
redmass: 4.9813 2.4510 5.2424 5.0541 6.2170 2.1985 4.0770 5.8639 1.2393 7.6565 4.7989 4.8461 4.0284 7.0465 2.8419 6.0767 2.6944 5.3352 2.4234 6.0937 7.0710 4.3237 4.5817 3.3653 7.5139 1.5115 5.8400 1.2706 1.5544 3.3888 1.7841 1.3186 1.3701 3.0315 2.0592 1.1956 2.2727 1.6785 3.2240 1.3389 2.2790 1.4520 2.1471 2.8031 1.1917 1.9375 1.3556 1.3383 2.2416 6.8957 1.2142 7.2377 3.7063 1.0989 1.0391 1.0535 2.4512 7.6994 7.4419 6.1508 5.7492 1.0605 1.0362 1.0972 1.1005 1.0904 1.0997 1.0904 1.0906 1.0895 1.0949 1.0958
irintensity: 0.0655 4.3683 3.4272 2.2140 0.2035 0.2494 0.3617 2.6190 0.8516 1.1165 2.1736 15.0877 0.9257 1.3850 0.0247 5.0278 7.4541 2.2036 3.6203 2.8619 0.4203 24.3044 4.0831 3.2933 47.6231 2.8987 1.5795 0.0364 76.3818 6.1911 0.0072 16.1006 0.0932 0.8212 18.9333 35.0789 85.8849 1.1385 21.4015 19.0511 152.0334 85.8292 261.4860 176.8713 0.1101 37.5452 10.1352 2.5796 81.0950 135.1823 23.2409 29.8793 42.5836 24.5406 12.5788 17.8098 11.4118 146.7049 7.5879 65.3434 60.3222 40.7314 29.7614 11.8423 29.9814 0.4433 29.7761 11.2455 6.5359 5.5696 0.1077 2.5025
temp: 298.150 k
press: 1.00000 atm
elementType: 8 8 8 7 6 6 6 6 6 6 6 6 6 6 6 1 1 1 1 1 1 1 1 1 1 1
symmnumber: 1
zpe: 517130.5 jmol-1
zpe.correction: 0.196965 hartree
zpe.thermalcorrener: 0.211382 hartree
zpe.thermalcorrenthalpy: 0.212326 hartree
zpe.thermalcorrgfe: 0.153388 hartree
zpe.sumelectzpe: -705.013783 hartree
zpe.sumelectthermal: -704.999366 hartree
zpe.sumelectthermalent: -704.998422 hartree
zpe.sumelectthermalfe: -705.057360 hartree
dipole: -3.9237 -1.9410 0.0035
dipole: 4.3775
quadrupole: -120.9500 -83.8788 -88.5841
quadrupole: 15.7486 -0.0304 0.0087
quadrupole: -23.1457 13.9255 9.2202 15.7486 -0.0304 0.0087
hfenergy: -705.2107479 hartree
pointgroup: C01 [X(C11H11N1O3)]
dipole: 1.5352529 -0.7797153 -0.0348095 debye
dipolederiv: -0.994118 -0.0152586 0.0108865 -0.4715878 -0.7286481 0.0013386 0.0053408 -0.0056845 -0.2946191 -0.7978403 -0.1894315 0.0067008 -0.3601333 -0.7131195 0.0003629 0.0047412 -0.0023501 -0.2291944 -0.9397931 0.1939758 0.0130319 0.3101281 -0.6117207 -0.008896 0.0142013 -0.0070943 -0.2284097 2.2827213 0.0621052 -0.0314669 0.1528569 1.0926867 0.0072878 -0.0301767 0.0087813 0.1925811 0.3354829 -0.0345293 -0.0049502 -0.0530827 0.0580906 0.0008787 -0.005507 0.0007107 0.0450335 -0.1913181 0.1476349 0.0076535 0.435909 -0.2763113 -0.0130775 0.0123293 -0.0087023 0.1544602 0.3135244 -0.0009639 -0.005982 0.0117488 0.1401922 0.0024595 -0.0054955 0.0025623 -0.0681229 -0.2943223 -0.173906 0.0009025 -0.2136989 -0.018404 0.0043515 0.0005209 0.0037481 -0.122056 -0.3966892 0.182731 0.0059584 0.1326907 0.0884227 0.0006261 0.0051206 -0.0001611 -0.1478646 -1.0324807 -0.0735726 0.0159702 -0.1979571 0.0609239 0.0032095 0.0143693 0.0012213 0.051973 2.1903565 -0.2135744 -0.0359528 0.1395245 0.7881646 0.0072982 -0.032332 0.012783 0.1188909 0.2171433 0.1545927 -0.0031761 -0.088364 -0.0311647 0.0020867 -0.0058169 -0.0016139 -0.0986699 0.2931232 -0.138576 -0.0074861 0.1878956 -0.0425381 -0.0023239 -0.0037451 0.0026293 -0.0932123 -1.3271918 0.0967696 0.0190357 0.2343871 0.0408447 -0.0006008 0.0207144 0.0015062 -0.2024546 -0.0812056 -0.0267184 0.001866 -0.0237382 0.0661351 0.0005276 0.0017121 0.0006544 0.0570247 -0.0283664 -0.0151649 0.073052 -0.0813816 0.0406273 0.0882985 0.0723307 0.1099113 -0.0290033 -0.0330817 -0.0165493 -0.0734718 -0.0820834 0.0462067 -0.0835334 -0.0749006 -0.1071877 -0.029866 0.0809796 -0.0101761 0.0008704 -0.0302555 -0.0185179 -0.0015617 0.0007202 -0.0018265 0.14695 0.0196564 0.0946383 0.0028379 0.0720324 -0.0028365 -0.002663 0.0026077 -0.003033 0.1400825 0.0501051 -0.0800463 0.0006372 -0.0622893 -0.0273841 -0.00103 0.0008412 -0.0007765 0.1518271 0.1017099 -0.0489722 0.0005327 -0.0164418 0.0509086 -0.0010772 0.0008534 -0.0005657 0.1711015 0.083348 0.0632505 0.002072 0.0251707 0.0774584 -0.0014416 0.0016503 -0.0020055 0.1726229 0.0778101 -0.042799 0.0006995 -0.0616345 -0.0869765 -0.0021352 0.0007377 -0.0024364 0.1551322 0.0834623 -0.0114113 0.0090101 -0.0693134 0.0326899 0.1113393 0.0386704 0.0974012 -0.0580619 0.081651 -0.0141291 -0.0139426 -0.0716723 0.0382922 -0.1064984 -0.0451646 -0.0943711 -0.0619668 -0.0946669 0.1100808 0.0047113 0.18129 -0.0640223 -0.0052261 0.0056768 -0.0041004 0.1058216 unknown
polarizability: 301.5428408|-4.3068349|137.4559433|-3.7849141|0.9345653|62.627111 unknown
InChI: InChI=1S/C11H11NO3/c1-2-11(13)8-5-9-3-6-10(7-4-9)12(14)15/h3-8H,2H2,1H3
charge 0 multiplicity 1
26 atoms
O  4.141969 1.302946 -0.067828
O  -4.799177 -1.429831 0.038566
O  -5.096435 0.833326 0.067528
N  -4.347624 -0.219104 0.044771
C  -0.080129 0.333403 -0.014277
C  4.842289 -1.046031 -0.111314
C  1.365993 0.58315 -0.03374
C  -0.647104 -0.97721 -0.020089
C  -0.962579 1.454071 0.011645
C  -2.878166 -0.026151 0.024503
C  3.808312 0.080491 -0.078888
C  -2.037468 -1.163922 -0.000853
C  -2.357925 1.28629 0.03106
C  2.374122 -0.342707 -0.061227
C  6.29752 -0.553607 -0.127835
H  4.655143 -1.70388 0.764222
H  4.626749 -1.678553 -0.998945
H  1.686514 1.635843 -0.025676
H  0.006153 -1.855009 -0.039639
H  -0.539932 2.464967 0.016446
H  -2.48711 -2.16018 -0.004969
H  -3.043823 2.136933 0.050926
H  2.174651 -1.422389 -0.07186
H  6.486364 0.082777 -1.009231
H  6.514737 0.058531 0.764137
H  6.999554 -1.405654 -0.150736
