program: Gaussian 09
title: 000290131
version: EM64L-G09RevD.01
frameworkgroup: C1[X(C13H15N5O4)]
method: RPBEPBE
basis: SDD
operation: Freq
keyword: #p
keyword: freq=noraman
keyword: PBEPBE/SDD
title: #p freq=noraman PBEPBE/SDD
converged: YES YES NO NO
title: Mulliken charges:
elementType: O O O O N N N N N C C C C C C C C C C C C C H H H H H H H H H H H H H H H
charge: -0.280257 -0.275010 -0.216565 -0.165116 -0.165481 -0.080953 -0.084309 -0.060219 -0.607211 -0.156319 -0.163094 -0.124539 -0.092434 0.328328 -0.688709 -0.693711 -0.063682 0.202117 -0.193007 -0.099576 0.174390 -0.358343 0.288482 0.285188 0.261754 0.266943 0.268466 0.221525 0.221256 0.220979 0.220579 0.242892 0.169083 0.269467 0.243806 0.347507 0.335771
chargesum: 0.00000
title: Mulliken charges with hydrogens summed into heavy atoms:
elementType: O O O O N N N N N C C C C C C C C C C C C C
charge: -0.280257 -0.275010 -0.216565 -0.165116 -0.165481 -0.080953 -0.084309 -0.060219 0.076067 0.132163 0.122095 0.137215 0.174509 0.328328 0.022537 -0.009261 0.105402 0.202117 0.076460 -0.099576 0.174390 -0.114537
polarizability: 2.54811949e+02 4.21174116e+00 1.65909240e+02 3.72984982e+00 1.83654883e+01 1.28210345e+02
1716.lowfreq: -4.8347 -0.0003 0.0007 0.0007 4.0602 13.0916 26.8266 42.6208 50.9533
frequency: 26.7751 42.6083 50.9152 74.6693 91.0621 100.2116 113.4085 145.3140 167.6307 196.0881 206.5595 222.0512 238.6171 244.7865 265.8978 282.8466 293.8638 309.7130 350.3466 369.5484 389.7580 409.9082 483.3804 511.9321 527.5402 534.5599 550.4347 561.7640 594.3445 610.6091 625.1021 647.9950 665.0630 674.2948 700.8206 718.8151 726.7424 733.5100 754.8301 791.6438 793.2285 825.5169 839.3103 860.4845 877.7879 905.4841 920.8508 928.8531 937.2348 958.4982 960.8998 981.7551 986.3627 1001.1050 1019.8084 1025.1300 1053.6632 1054.7635 1137.5864 1154.7487 1172.7808 1178.4515 1202.5947 1209.0638 1221.5201 1242.5042 1252.7239 1260.3416 1270.8783 1290.0089 1299.0696 1311.1879 1324.3778 1331.8949 1348.1804 1375.1662 1380.2710 1382.3996 1392.8456 1394.3596 1436.8689 1452.0366 1456.8900 1465.1251 1471.4063 1484.6217 1543.8864 1580.5372 1635.4285 1655.6469 2860.2461 2993.3424 3003.3375 3007.1854 3086.9170 3095.3236 3095.8848 3101.5386 3109.4141 3109.9390 3121.5105 3163.8673 3231.3108 3538.2511 3692.8165
redmass: 6.3273 5.2773 4.3623 4.8640 5.3628 6.1519 4.7698 5.0568 1.1024 4.4869 4.8724 4.3657 3.1827 1.1202 5.9020 4.7075 5.0486 4.0310 3.9733 3.6528 2.9327 5.6716 4.1918 8.9531 1.2831 4.0570 1.0596 4.0336 6.2009 4.9898 4.7759 4.5787 6.4474 5.9227 6.6711 5.7967 7.3285 3.8039 4.1706 4.1996 4.9491 1.9734 5.3792 8.5635 2.6188 4.8600 1.7005 1.4335 2.4103 2.4896 2.5376 2.4633 1.4167 4.0825 4.5827 4.1242 5.5296 2.3655 1.8751 4.8676 1.8237 1.4817 2.2314 2.1309 2.3843 1.5935 1.6602 3.3278 1.5715 1.6414 4.1108 1.5773 3.7922 1.2690 1.6615 1.3238 1.3386 1.3409 4.0840 1.2394 2.9253 1.0509 1.0493 3.7866 1.0710 1.0485 7.3343 1.8483 2.8183 9.2154 1.0850 1.0352 1.0832 1.0356 1.0874 1.0931 1.0943 1.1010 1.0991 1.0893 1.1009 1.0920 1.0987 1.0444 1.1056
irintensity: 6.6555 0.3528 2.1396 5.6303 9.5633 1.0495 4.0458 6.0883 0.8390 0.2986 7.3660 5.2818 2.7771 1.4004 4.1846 6.1767 0.7346 5.0929 1.4618 0.2468 5.6920 5.4425 14.6506 4.1121 247.4300 11.1733 0.0558 2.3468 7.5724 7.9049 0.6055 53.8400 15.2443 18.1130 4.7237 6.7598 7.7522 17.3204 34.1523 91.8361 73.0347 12.4661 6.7295 23.6388 10.4942 38.6542 1.6107 11.9058 14.3105 5.9740 1.5854 17.2753 13.3019 183.4834 8.6048 3.7040 76.3567 10.8562 43.3996 13.0544 93.2259 62.2152 99.0120 8.1439 66.7441 7.4778 28.4241 79.0116 7.6194 29.1162 22.0230 12.1072 38.1103 5.2197 116.9574 7.3633 27.2104 16.8298 12.2657 27.0621 67.0021 5.3963 4.2571 19.6878 0.9503 11.7336 52.1907 30.5187 659.0854 126.0984 84.2872 16.3580 12.6045 15.3265 7.6421 11.1874 5.2031 8.7139 22.4884 9.8190 19.1560 13.3425 0.1261 145.8723 51.7810
temp: 298.150 k
press: 1.00000 atm
elementType: 8 8 8 8 7 7 7 7 7 6 6 6 6 6 6 6 6 6 6 6 6 6 1 1 1 1 1 1 1 1 1 1 1 1 1 1 1
symmnumber: 1
zpe: 738472.6 jmol-1
zpe.correction: 0.281269 hartree
zpe.thermalcorrener: 0.300487 hartree
zpe.thermalcorrenthalpy: 0.301431 hartree
zpe.thermalcorrgfe: 0.233470 hartree
zpe.sumelectzpe: -1077.393603 hartree
zpe.sumelectthermal: -1077.374385 hartree
zpe.sumelectthermalent: -1077.373441 hartree
zpe.sumelectthermalfe: -1077.441402 hartree
dipole: 1.3116 1.0047 -1.1789
dipole: 2.0297
quadrupole: -107.1522 -125.0447 -137.2597
quadrupole: -3.0004 5.8985 1.3245
quadrupole: 16.0000 -1.8925 -14.1075 -3.0004 5.8985 1.3245
hfenergy: -1077.6748724 hartree
pointgroup: C01 [X(C13H15N5O4)]
dipole: -0.3325937 0.6563207 -0.3102731 debye
polarizability: 244.6838979|-34.985283|132.8350604|8.739993|8.13732|171.4125766 unknown
InChI: InChI=1S/C13H15N5O4/c1-13(2)21-8-6(3-19)20-12(9(8)22-13)18-5-17-7-10(14)15-4-16-11(7)18/h3-6,8-9,12H,14H2,1-2H3
charge 0 multiplicity 1
37 atoms
O  -2.276357 2.064489 -0.70741
O  -3.137854 1.169124 1.297024
O  -1.590088 -1.063205 -0.648547
O  -0.085216 -2.657396 1.216677
N  0.65107 -0.17638 -1.080585
N  2.67249 -0.900258 -1.905429
N  1.333297 0.280945 1.278621
N  3.714889 -0.19378 1.656905
N  5.143989 -1.010055 -0.038079
C  -1.193479 1.262034 -0.127557
C  -1.802255 0.58031 1.140898
C  -0.793136 0.098442 -1.07573
C  -1.824654 -0.941458 0.804261
C  -3.560137 1.752583 -0.004096
C  -4.387316 0.752172 -0.825243
C  -4.277994 3.068065 0.281062
C  -0.855763 -1.779288 1.652955
C  1.558631 -0.110015 -0.011592
C  1.380935 -0.668975 -2.181673
C  2.795986 -0.553189 -0.545429
C  3.903437 -0.590783 0.352127
C  2.468377 0.209541 2.039728
H  -0.351196 1.932582 0.094407
H  -1.235279 0.799894 2.055777
H  -1.096754 0.314356 -2.112308
H  -2.841582 -1.336714 1.00068
H  -3.804341 -0.157847 -1.0456
H  -5.29815 0.473488 -0.267062
H  -4.688652 1.214896 -1.781092
H  -4.532903 3.571955 -0.666498
H  -5.208048 2.877609 0.843304
H  -3.627094 3.727847 0.87609
H  -0.954902 -1.56785 2.750396
H  0.908415 -0.836665 -3.14756
H  2.36819 0.51067 3.086788
H  5.295611 -1.323321 -0.994748
H  5.896737 -1.031726 0.64694
