program: Gaussian 09
title: 000290124
version: EM64L-G09RevD.01
frameworkgroup: C1[X(C16H26O7S2)]
method: RPBEPBE
basis: SDD
operation: Freq
keyword: #p
keyword: freq=noraman
keyword: PBEPBE/SDD
title: #p freq=noraman PBEPBE/SDD
converged: YES YES NO NO
title: Mulliken charges:
elementType: S S O O O O O O O C C C C C C C C C C C C C C C C H H H H H H H H H H H H H H H H H H H H H H H H H H
charge: 0.222074 0.168572 -0.219555 -0.274785 -0.291855 -0.246554 -0.248798 -0.232051 -0.257033 -0.124232 0.008422 -0.577226 -0.395449 -0.040726 -0.367928 -0.579062 -0.587041 0.323134 0.302010 -0.659645 -0.660688 -0.764803 0.334170 -0.775601 -0.762527 0.269321 0.303942 0.304699 0.299912 0.319553 0.260411 0.237790 0.259451 0.247441 0.239483 0.320200 0.234786 0.230745 0.219620 0.222739 0.239019 0.222113 0.252975 0.247363 0.246987 0.297975 0.243210 0.236687 0.245460 0.240601 0.264693
chargesum: 0.00000
title: Mulliken charges with hydrogens summed into heavy atoms:
elementType: S S O O O O O O O C C C C C C C C C C C C C C C C
charge: 0.222074 0.168572 -0.219555 -0.274785 -0.291855 -0.246554 -0.248798 -0.232051 -0.257033 0.145089 0.312364 -0.272527 -0.095537 0.278828 0.130273 -0.072169 -0.027358 0.323134 0.302010 0.025506 0.023183 -0.017479 0.334170 0.002270 -0.011773
polarizability: 2.65051811e+02 2.10220999e+01 2.25068867e+02 -1.30177058e+01 -1.12552265e+00 2.08586100e+02
1716.lowfreq: -9.4199 -5.8355 0.0006 0.0015 0.0020 3.3577 6.5320 15.4684 24.9331
frequency: 2.1680 15.2621 24.8543 28.6335 31.5564 32.5771 37.9746 42.8074 53.3933 60.9756 62.8261 67.8660 74.6881 90.8874 94.6734 99.4321 105.6525 118.6134 125.2331 143.9951 153.4454 166.0629 170.5369 200.4622 204.2480 226.5945 234.0594 239.5947 255.9911 291.4902 297.1309 303.8806 327.9576 354.9070 376.6061 392.2762 418.3606 430.6629 461.1208 469.1754 515.7292 551.7594 560.0489 565.9139 570.0530 588.0111 615.6090 619.4852 620.5424 640.7234 677.3308 743.8025 779.4376 785.6782 797.5923 803.1428 820.1296 844.1420 866.8072 892.7722 935.1929 952.0214 957.9160 987.0791 993.9798 994.5598 995.4333 999.7224 1008.5567 1016.1632 1026.3271 1039.3376 1041.4301 1043.0446 1043.6992 1051.2176 1065.0301 1071.3381 1079.4078 1096.5895 1133.4977 1182.3222 1190.3199 1199.7101 1203.7747 1207.3879 1227.3366 1236.6633 1242.5121 1243.3230 1254.0336 1262.7103 1273.8534 1283.5667 1291.6847 1304.9839 1314.2847 1333.8674 1361.1511 1366.1284 1378.4082 1383.3537 1389.3079 1396.5500 1397.8386 1450.8757 1452.2489 1453.2670 1453.4772 1454.2595 1455.5084 1456.9798 1462.9324 1465.9769 1470.2885 1471.0806 1482.7338 1483.9081 1653.5513 1658.5917 1666.2708 2986.0133 2986.1570 3002.7522 3006.4509 3007.8647 3012.1657 3016.0867 3026.8979 3037.2949 3047.0878 3066.2409 3077.1683 3078.3765 3078.9879 3080.8140 3084.5059 3089.4467 3091.1531 3097.4664 3101.7009 3104.8005 3110.3554 3116.8807 3141.5417 3141.6372 3142.1257
redmass: 2.6662 5.6819 3.7966 2.3177 1.8978 2.2457 3.4256 3.3957 4.2075 3.6950 3.8534 4.2634 3.4950 2.1308 2.7157 1.8839 4.7826 4.9931 5.0786 1.2034 4.0039 6.1116 6.3819 7.9297 4.6581 5.3710 1.1172 1.1511 3.2255 3.7267 3.8573 4.7185 6.2332 4.3557 4.6084 5.3174 5.3486 4.0243 3.8361 3.8646 4.1473 3.7671 3.2418 3.6293 3.5766 6.3015 5.1103 4.5151 4.8677 5.1079 4.7239 5.1056 4.4381 1.1333 1.1450 4.8964 6.2982 4.9492 4.0854 3.9257 5.9328 4.8534 4.4682 2.4362 2.1844 1.8323 1.8249 2.0142 2.6282 2.9575 1.2176 2.2455 1.6864 1.2621 2.1524 1.6390 2.4066 2.3142 2.7964 3.8503 2.5569 2.8238 2.0841 1.5939 1.6243 3.0395 1.2170 1.2382 1.2241 1.2509 1.2301 1.2557 1.2584 1.2603 1.2374 1.2198 1.2492 1.2906 1.3070 1.4012 1.2664 1.2429 1.2433 1.2026 1.2042 1.0861 1.0573 1.0485 1.0599 1.0660 1.0577 1.0734 1.0604 1.0786 1.0388 1.0448 1.0480 1.0478 9.1146 9.4839 9.6464 1.0355 1.0354 1.0366 1.0377 1.0370 1.0598 1.0588 1.0841 1.0572 1.0863 1.0868 1.1019 1.1005 1.0863 1.0986 1.0993 1.0896 1.0973 1.0955 1.0957 1.1053 1.1059 1.1082 1.1020 1.1017 1.1010
irintensity: 0.5652 0.3115 0.6648 0.9541 0.2744 0.4573 0.7912 0.4630 0.9429 1.5318 0.5163 0.7644 3.9932 2.5751 1.3663 2.5794 9.6924 0.6196 1.2482 0.7571 5.8257 0.5574 0.4380 2.8222 3.1800 1.4358 0.0788 0.3704 8.3722 5.7042 1.7223 4.4795 5.7064 4.6789 24.3882 5.9207 4.2775 7.5483 5.8136 7.0367 7.0087 7.3829 7.3894 10.8332 1.1089 29.8060 13.2525 2.2064 8.4991 10.3439 6.5612 11.2067 13.0357 6.7183 10.3855 17.7138 32.6847 14.2853 49.3586 34.9470 114.6535 63.2711 14.5252 2.9056 69.8511 34.7794 20.4597 58.6982 69.9238 82.0339 0.3287 17.0286 8.8577 1.6170 13.4943 10.7051 2.5630 3.5958 1.5787 22.0494 32.3860 118.3939 438.8285 38.5608 223.5745 26.1525 14.6461 0.9716 21.4064 6.0327 11.3858 12.2254 8.3635 12.2938 13.4853 7.4256 8.8618 1.9927 5.1927 3.5192 68.9245 63.8291 55.1173 19.8574 20.6668 17.6291 31.7889 22.0287 8.6859 0.4030 23.6714 18.6351 32.8781 3.6986 14.4010 13.5948 7.7036 8.6115 67.3175 281.8912 142.8723 42.6999 27.0765 8.3274 2.1620 1.9897 24.3370 23.1360 3.5326 21.2853 8.3911 2.6061 4.6658 25.2189 7.9706 26.0254 16.1050 13.4318 5.5941 8.1630 9.6704 45.5816 12.7572 3.9044 9.9777 7.2642 7.8303
temp: 298.150 k
press: 1.00000 atm
elementType: 16 16 8 8 8 8 8 8 8 6 6 6 6 6 6 6 6 6 6 6 6 6 6 6 6 1 1 1 1 1 1 1 1 1 1 1 1 1 1 1 1 1 1 1 1 1 1 1 1 1 1
symmnumber: 1
zpe: 1060656.3 jmol-1
zpe.correction: 0.403983 hartree
zpe.thermalcorrener: 0.435223 hartree
zpe.thermalcorrenthalpy: 0.436167 hartree
zpe.thermalcorrgfe: 0.333031 hartree
zpe.sumelectzpe: -1946.018786 hartree
zpe.sumelectthermal: -1945.987546 hartree
zpe.sumelectthermalent: -1945.986601 hartree
zpe.sumelectthermalfe: -1946.089738 hartree
dipole: 2.6902 0.6993 -5.4610
dipole: 6.1277
quadrupole: -154.8554 -150.1304 -166.2326
quadrupole: 7.1405 -0.6856 -0.2817
quadrupole: 2.2174 6.9424 -9.1598 7.1405 -0.6856 -0.2817
hfenergy: -1946.4227682 hartree
pointgroup: C01 [X(C16H26O7S2)]
dipole: 0.0714824 -1.1382779 2.1239731 debye
polarizability: 222.3170499|-21.8373343|264.7033187|10.4980814|-9.0531634|211.6864094 unknown
InChI: InChI=1S/C16H26O7S2/c1-6-24-15-14(22-11(5)19)13(23-16(15)25-7-2)12(21-10(4)18)8-20-9(3)17/h12-16H,6-8H2,1-5H3
charge 0 multiplicity 1
51 atoms
S  3.654702 0.102791 0.484406
S  1.518373 2.217787 -0.848474
O  -0.182839 1.340025 1.240574
O  0.894128 -2.050106 1.118142
O  -1.4399 -1.269678 -1.116232
O  -3.075708 1.166464 1.141719
O  1.136318 -3.167816 -0.929496
O  -1.782389 -0.264086 -3.197531
O  -2.651592 3.101343 -0.08677
C  -0.515843 -0.040018 0.758569
C  0.851263 -0.722801 0.459098
C  1.887373 0.216321 1.122577
C  1.235292 1.594401 0.92491
C  -1.457592 0.072862 -0.460563
C  -2.934065 0.35729 -0.094115
C  4.296778 -1.277788 1.632573
C  0.647775 3.905448 -0.688443
C  1.009307 -3.197004 0.312037
C  -1.565529 -1.29321 -2.525895
C  5.785846 -1.505345 1.33735
C  0.744838 4.644122 -2.029876
C  0.938613 -4.436649 1.176545
C  -2.873226 2.547549 1.012699
C  -1.393985 -2.703109 -3.034563
C  -2.94287 3.215528 2.36436
H  -1.014492 -0.553014 1.598989
H  1.044603 -0.849606 -0.618556
H  1.912745 -0.000873 2.206433
H  1.577472 2.370833 1.62532
H  -1.064985 0.824447 -1.16665
H  -3.443805 0.861802 -0.932235
H  -3.436041 -0.590436 0.158813
H  3.704033 -2.187831 1.446113
H  4.137217 -0.94766 2.674253
H  1.158308 4.460601 0.118804
H  -0.400379 3.713914 -0.41029
H  5.941685 -1.824997 0.291739
H  6.372878 -0.585311 1.507315
H  6.187533 -2.295077 1.998863
H  1.794894 4.815183 -2.327182
H  0.24325 4.075728 -2.832649
H  0.244313 5.626786 -1.949489
H  -0.111013 -4.621038 1.469142
H  1.307832 -5.30471 0.611256
H  1.521128 -4.303446 2.102488
H  -0.408239 -3.087084 -2.718804
H  -1.480332 -2.714643 -4.130412
H  -2.160534 -3.364034 -2.593052
H  -3.751106 2.785204 2.977045
H  -3.087617 4.298847 2.241668
H  -1.987123 3.032992 2.888375
