program: Gaussian 09
title: 000290122
version: EM64L-G09RevD.01
frameworkgroup: C1[X(C13H20N2O6S)]
method: RPBEPBE
basis: SDD
operation: Freq
keyword: #p
keyword: freq=noraman
keyword: PBEPBE/SDD
title: #p freq=noraman PBEPBE/SDD
converged: YES YES NO NO
title: Mulliken charges:
elementType: S O O O O O O N N C C C C C C C C C C C C C H H H H H H H H H H H H H H H H H H H H
charge: 0.162175 -0.256058 -0.463961 -0.480763 -0.425766 -0.287801 -0.243697 -0.170109 -0.401971 -0.548952 -0.135652 -0.073803 -0.045942 -0.187548 -0.337125 -0.212123 0.225274 -0.578503 0.227885 0.091686 -0.658897 -0.765027 0.329645 0.286973 0.276210 0.293426 0.250252 0.194209 0.245057 0.352623 0.318264 0.252104 0.301464 0.364209 0.358859 0.229372 0.226689 0.230859 0.349687 0.246396 0.216115 0.244265
chargesum: 0.00000
title: Mulliken charges with hydrogens summed into heavy atoms:
elementType: S O O O O O O N N C C C C C C C C C C C C C
charge: 0.162175 -0.256058 -0.111338 -0.116554 -0.076078 -0.287801 -0.243697 -0.170109 -0.043112 -0.219307 0.151321 0.202408 0.247484 0.062703 0.102141 0.106142 0.225274 -0.024935 0.227885 0.091686 0.028023 -0.058252
polarizability: 2.39449820e+02 -1.27376328e+01 1.99671571e+02 -6.96576867e-01 -2.36068959e+01 1.45488605e+02
1716.lowfreq: -0.5579 -0.0004 0.0011 0.0013 5.1347 8.7482 23.5315 28.9860 42.1861
frequency: 23.2129 28.7115 42.1268 44.7261 50.9114 71.2362 88.0366 96.2607 108.3138 119.0363 124.3543 129.6368 160.4353 172.0865 193.3234 205.9801 225.2252 232.5393 235.4919 239.8498 257.9368 276.1840 286.6642 305.1592 322.3281 330.7938 373.4567 380.3764 411.6968 429.9008 461.9781 485.0332 491.1287 535.5380 556.7639 608.1360 616.5628 635.0958 653.2472 699.4996 717.1461 723.0778 751.4955 759.6728 779.2843 796.7134 807.3313 857.6220 873.5746 886.5954 902.5413 919.4294 937.1942 961.5577 967.9241 989.1708 996.4156 1011.0225 1018.8660 1042.8682 1045.1694 1052.9630 1059.8852 1065.1025 1075.5051 1117.2276 1134.8220 1163.2135 1167.1672 1189.3430 1212.1222 1218.9163 1237.1855 1246.2703 1247.2042 1261.7672 1279.8772 1280.8746 1295.5165 1311.1324 1322.6660 1335.8086 1346.8626 1367.5108 1378.1755 1381.8096 1389.8146 1397.5724 1397.9244 1404.5771 1425.3660 1450.8577 1468.1267 1470.2019 1472.0804 1472.7786 1482.5132 1619.2717 1628.9945 1666.1564 2952.1632 2987.8930 2988.2575 3002.0867 3012.6260 3047.3770 3050.0585 3063.5798 3067.7065 3070.7034 3076.8746 3083.4299 3089.6191 3098.9572 3102.4716 3145.7381 3498.2449 3525.2227 3567.7448 3588.2332
redmass: 5.1711 5.9754 3.9562 5.0034 6.1246 3.6601 5.0945 2.5194 1.0898 6.3395 3.9364 4.5637 4.7509 7.4230 4.5044 4.2713 1.4206 4.3396 2.2637 1.4827 4.2080 3.7092 2.5517 1.5485 3.2389 4.5111 4.2492 9.6498 4.0482 4.0634 5.6116 4.3245 4.5840 1.2234 6.8280 6.0526 4.7909 4.7444 5.7177 2.6224 3.7962 6.0981 7.3757 5.7463 2.2719 1.1293 4.8616 3.7493 3.6913 3.4089 3.3301 1.3751 3.0291 3.3870 5.6668 2.4753 1.8647 2.5710 2.1036 1.3491 2.3350 1.4686 1.8370 2.5076 2.2292 2.9603 4.8520 1.2622 1.1165 1.2093 1.4351 1.6141 2.6501 1.2980 1.4878 2.0671 1.5183 1.3501 1.2505 1.2472 1.2517 1.3393 1.8687 2.0072 1.3871 1.2988 1.5630 1.4004 1.2730 1.2627 2.4621 1.0439 1.0790 1.0743 1.0497 1.0749 1.0488 5.5570 9.6016 5.7923 1.0700 1.0363 1.0354 1.0858 1.0573 1.0855 1.0870 1.0865 1.0974 1.0875 1.1038 1.0988 1.0938 1.1005 1.1056 1.0961 1.0646 1.0769 1.0662 1.0668
irintensity: 1.0382 2.4481 0.7046 1.9034 2.2755 0.9000 6.7384 0.3936 0.1595 9.3863 4.9404 0.5162 6.9755 3.1760 31.3252 5.7466 16.6234 19.8204 8.2216 2.0303 4.1415 3.8169 19.7897 125.0635 19.9955 14.5966 1.3121 14.0280 9.5960 26.6564 11.0323 29.4805 8.8830 257.3680 6.8515 4.0272 6.9981 32.8743 11.5246 9.8991 5.9285 4.2517 9.7632 1.5717 102.9415 8.6650 30.3956 29.9339 37.9407 40.1381 12.0610 18.5334 31.5962 47.3716 44.8352 20.9364 20.4292 101.8035 139.9086 2.5484 20.2292 6.5949 27.3359 4.9553 4.5234 59.4722 14.5501 32.0771 62.3345 22.3419 27.3201 3.8772 5.3471 7.8529 34.6197 189.7822 56.5003 22.5356 5.3454 20.5875 0.7097 9.3224 41.6581 61.5539 8.5197 19.0553 2.5621 5.4073 23.1785 19.3969 66.7203 11.7720 7.8248 14.5572 13.5051 3.3903 7.4894 263.5340 281.6137 507.0079 71.7931 27.6209 25.9951 17.0239 10.5555 12.0344 8.9615 5.7841 13.9505 5.2092 4.9047 19.0965 12.3534 14.0583 30.8494 32.7713 10.3428 57.7561 9.9715 14.8825
temp: 298.150 k
press: 1.00000 atm
elementType: 16 8 8 8 8 8 8 7 7 6 6 6 6 6 6 6 6 6 6 6 6 6 1 1 1 1 1 1 1 1 1 1 1 1 1 1 1 1 1 1 1 1
symmnumber: 1
zpe: 867100.0 jmol-1
zpe.correction: 0.330261 hartree
zpe.thermalcorrener: 0.354203 hartree
zpe.thermalcorrenthalpy: 0.355148 hartree
zpe.thermalcorrgfe: 0.275258 hartree
zpe.sumelectzpe: -1464.588242 hartree
zpe.sumelectthermal: -1464.564299 hartree
zpe.sumelectthermalent: -1464.563355 hartree
zpe.sumelectthermalfe: -1464.643245 hartree
dipole: -5.3538 2.0703 2.9651
dipole: 6.4607
quadrupole: -148.6667 -138.1091 -140.7359
quadrupole: -2.5437 1.7464 -8.8114
quadrupole: -6.1628 4.3948 1.7680 -2.5437 1.7464 -8.8114
hfenergy: -1464.9185029 hartree
pointgroup: C01 [X(C13H20N2O6S1)]
dipole: 2.3527043 -0.5664145 0.7777928 debye
polarizability: 239.0326048|-2.1032194|193.9083935|-17.435001|26.9683259|151.6689981 unknown
InChI: InChI=1S/C13H20N2O6S/c1-3-22-10-8(18)9(7(17)5-16)21-12(10)15-4-6(2)11(19)14-13(15)20/h4,7-10,12,14,16-18H,3,5H2,1-2H3
charge 0 multiplicity 1
42 atoms
S  2.488966 -1.962397 0.438854
O  0.757414 1.225709 -0.599614
O  1.20962 1.26114 2.451309
O  4.433833 1.524429 -0.008038
O  3.497847 3.661848 -1.489021
O  -1.44355 -1.834802 -1.624083
O  -5.159296 -0.067418 0.590954
N  -1.087614 -0.166104 0.011104
N  -3.26751 -0.900785 -0.491055
C  1.25591 -0.608732 0.932559
C  2.018093 0.660948 1.369474
C  2.015466 1.553021 0.110168
C  0.361423 -0.16087 -0.266747
C  3.213234 1.307072 -0.83332
C  3.231942 2.314962 -1.998144
C  -1.622944 0.691365 0.982142
C  -1.902786 -1.021833 -0.76902
C  1.260237 -3.395456 0.161627
C  -2.96903 0.781703 1.244813
C  -3.900365 -0.049858 0.467363
C  2.041808 -4.643118 -0.270674
C  -3.547936 1.701045 2.29149
H  0.656256 -0.992681 1.773237
H  3.04495 0.456692 1.719258
H  1.967834 2.62928 0.355963
H  0.499876 -0.807202 -1.149029
H  3.176687 0.265937 -1.213141
H  3.997199 2.013679 -2.745898
H  2.244499 2.353512 -2.486239
H  1.68281 2.056441 2.804537
H  -0.878228 1.280172 1.527174
H  0.735539 -3.558589 1.119242
H  0.531259 -3.087237 -0.607159
H  5.175949 0.973085 -0.360211
H  -3.887074 -1.502932 -1.042823
H  2.571873 -4.474918 -1.224843
H  2.782292 -4.944085 0.491611
H  1.341356 -5.485445 -0.41766
H  4.268303 3.571545 -0.86533
H  -4.24416 2.426275 1.832231
H  -2.754755 2.256654 2.819501
H  -4.137228 1.130243 3.031741
