program: Gaussian 09
title: 000290117
version: EM64L-G09RevD.01
frameworkgroup: C1[X(C12H23N3O)]
method: RPBEPBE
basis: SDD
operation: Freq
keyword: #p
keyword: freq=noraman
keyword: PBEPBE/SDD
title: #p freq=noraman PBEPBE/SDD
converged: YES YES NO NO
title: Mulliken charges:
elementType: O N N N C C C C C C C C C C C C H H H H H H H H H H H H H H H H H H H H H H H
charge: -0.302675 -0.180798 -0.061769 -0.183269 -0.134594 -0.128201 -0.441665 -0.423579 -0.413874 -0.434743 0.247175 -0.607969 -0.336471 -0.357361 -0.658314 -0.661382 0.227233 0.260619 0.221564 0.216291 0.209403 0.222772 0.199334 0.219359 0.216548 0.247972 0.217086 0.193222 0.221441 0.267780 0.197402 0.229899 0.206871 0.204329 0.223889 0.213424 0.215466 0.235474 0.212111
chargesum: 0.00000
title: Mulliken charges with hydrogens summed into heavy atoms:
elementType: O N N N C C C C C C C C C C C C
charge: -0.302675 -0.180798 -0.061769 -0.183269 0.092638 0.132418 -0.003809 0.008595 0.004820 0.029777 0.247175 0.023780 0.128712 0.079409 -0.016672 0.001669
polarizability: 1.73075009e+02 2.33709836e+00 1.43344425e+02 4.41144993e+00 -2.50094425e+00 1.33228233e+02
1716.lowfreq: -11.4315 -8.1634 -0.0006 -0.0004 0.0004 2.6139 34.4018 51.2999 54.1319
frequency: 34.3487 51.1049 53.9573 67.6518 86.7602 123.9436 142.8113 162.0065 176.4316 206.4687 220.6290 229.7217 260.0185 300.6283 316.1537 328.3136 335.5544 345.6681 364.0497 406.5006 445.9916 487.7097 492.7353 536.4126 601.8971 662.4016 720.4062 746.7909 757.6053 773.6994 780.0050 796.3933 822.4407 851.3670 864.0871 903.3096 931.1665 935.1712 967.1329 979.4388 999.0163 1025.9432 1035.9979 1064.6708 1067.2945 1071.1317 1076.7179 1083.2412 1099.0179 1109.6666 1114.2500 1150.2228 1169.8181 1182.1883 1195.9076 1201.1398 1203.8979 1223.6955 1243.9443 1263.1831 1269.8100 1287.0558 1288.5915 1298.1280 1311.0369 1315.4613 1336.1899 1340.0713 1342.2157 1358.8229 1371.3945 1383.8527 1385.2127 1401.5584 1429.8309 1451.7560 1457.4883 1463.3171 1466.6870 1468.4874 1469.6651 1471.4906 1477.5249 1479.5264 1485.1122 1485.5946 1487.7423 1554.2581 2836.5988 2860.9698 2909.9232 2975.6559 2977.8078 2983.5607 3005.8021 3007.2529 3009.8815 3011.7180 3018.2064 3025.2986 3060.9650 3069.9780 3072.1657 3072.8419 3077.5975 3079.6835 3083.3573 3083.4701 3090.5879 3098.6063 3101.6038
redmass: 3.0307 2.8148 2.7285 2.8715 6.4217 3.3413 2.8112 1.8888 2.1215 1.1891 1.2184 1.2715 2.1444 2.8413 2.4780 2.3423 2.2225 2.8100 2.9190 3.3339 2.8726 3.5685 3.5034 3.4730 3.3785 3.8477 7.2995 4.7574 4.7774 1.2478 1.2784 1.5558 2.4897 2.6348 2.4179 2.7359 2.0073 1.7459 2.3575 1.7645 2.4994 2.2900 2.0225 2.3907 2.0727 1.5828 1.9380 1.7342 1.7593 2.2810 1.2837 2.4568 1.2200 1.4377 1.8539 2.0692 2.6203 1.7109 1.4866 1.4268 1.4880 1.5923 1.3350 1.5644 1.4864 1.5445 1.3810 1.4565 1.3244 1.4189 1.3838 1.2182 1.2314 2.5416 1.1634 1.0846 1.0699 1.0674 1.0663 1.0492 1.0593 1.0891 1.0509 1.0778 1.1054 1.0776 1.1145 7.2301 1.0695 1.0564 1.0672 1.0577 1.0445 1.0365 1.0863 1.0675 1.0624 1.0733 1.0927 1.0633 1.0970 1.1009 1.0937 1.0958 1.0961 1.0961 1.0963 1.0904 1.1001 1.1041 1.1006
irintensity: 0.2787 0.0616 0.2962 0.6491 7.5859 1.3146 0.7881 1.0853 1.6104 0.1863 0.8769 2.1359 0.9983 5.5059 0.0939 5.8435 1.3518 11.1256 3.7357 6.8691 11.6393 3.8362 1.6151 4.3387 7.4248 1.3755 10.8011 2.9299 1.6697 10.0376 7.0454 6.5421 20.1607 4.8835 2.4548 1.1643 7.1834 0.5453 7.9564 12.9759 13.8600 50.3334 10.1615 11.3921 50.3844 3.6717 26.1818 1.5382 13.6280 7.8665 4.1405 41.7640 8.9570 16.4345 19.3285 13.8012 15.6930 21.1622 8.8526 11.1419 10.9432 128.2747 75.2489 19.3751 4.0900 5.6733 19.6581 15.6299 13.0262 1.6592 22.8716 10.7493 39.4417 357.0897 1.4967 1.3621 13.9794 11.2625 11.6366 0.7106 13.5876 16.8320 3.6541 8.7401 8.6621 40.2752 51.0649 212.1007 72.4835 146.7103 52.9309 38.6532 37.7444 39.6606 19.7822 48.1526 33.9790 50.5703 36.6879 66.7943 14.4532 26.5156 42.7740 8.6488 5.8576 48.7729 41.7358 7.1471 29.3092 61.4436 47.2606
temp: 298.150 k
press: 1.00000 atm
elementType: 8 7 7 7 6 6 6 6 6 6 6 6 6 6 6 6 1 1 1 1 1 1 1 1 1 1 1 1 1 1 1 1 1 1 1 1 1 1 1
symmnumber: 1
zpe: 901393.6 jmol-1
zpe.correction: 0.343323 hartree
zpe.thermalcorrener: 0.360340 hartree
zpe.thermalcorrenthalpy: 0.361284 hartree
zpe.thermalcorrgfe: 0.298524 hartree
zpe.sumelectzpe: -709.255487 hartree
zpe.sumelectthermal: -709.238470 hartree
zpe.sumelectthermalent: -709.237526 hartree
zpe.sumelectthermalfe: -709.300286 hartree
dipole: -0.2574 0.8697 -3.0157
dipole: 3.1491
quadrupole: -90.9722 -96.6054 -102.8258
quadrupole: -2.6283 4.4467 2.5742
quadrupole: 5.8289 0.1958 -6.0247 -2.6283 4.4467 2.5742
hfenergy: -709.5988099 hartree
pointgroup: C01 [X(C12H23N3O1)]
dipole: 0.0892703 -0.3205149 -1.1934436 debye
polarizability: 172.4244643|4.1962183|143.666327|-5.5524488|2.2556488|133.5568745 unknown
InChI: InChI=1S/C12H23N3O/c1-4-14(5-2)12(16)15-10-6-7-11(15)9-13(3)8-10/h10-11H,4-9H2,1-3H3
charge 0 multiplicity 1
39 atoms
O  0.818458 0.818992 1.86553
N  -0.130109 -0.569254 0.233401
N  -2.750032 0.635729 -0.223591
N  2.031251 0.381276 -0.107164
C  -0.735167 -0.508571 -1.135558
C  -1.301881 -0.896089 1.09941
C  -1.562294 -1.824964 -1.17255
C  -1.930915 -2.090867 0.327284
C  -1.647471 0.744993 -1.207937
C  -2.259192 0.323581 1.146565
C  0.899058 0.25047 0.724045
C  -3.658182 1.794362 -0.252646
C  3.011819 1.4401 0.234812
C  2.549088 -0.750509 -0.915644
C  3.145312 2.494175 -0.884093
C  3.330304 -1.784742 -0.070471
H  0.029444 -0.443697 -1.924911
H  -0.963363 -1.141517 2.117996
H  -0.952445 -2.648436 -1.5850
H  -2.462307 -1.703554 -1.797394
H  -3.02284 -2.124043 0.476168
H  -1.495936 -3.042561 0.679188
H  -1.010859 1.652765 -1.037955
H  -2.088027 0.830303 -2.220651
H  -3.134125 0.090761 1.783549
H  -1.708583 1.176318 1.609102
H  -4.06279 1.927583 -1.272869
H  -3.164966 2.752169 0.051992
H  -4.506974 1.61775 0.432824
H  2.669754 1.906525 1.173404
H  3.99877 0.978967 0.442051
H  1.719094 -1.265389 -1.422945
H  3.200912 -0.331683 -1.705787
H  3.470215 2.039958 -1.83894
H  2.177521 2.997491 -1.055945
H  3.89163 3.260739 -0.603171
H  4.18649 -1.320786 0.451105
H  2.666932 -2.235309 0.688517
H  3.721105 -2.594037 -0.715423
