program: Gaussian 09
title: 000290112
version: EM64L-G09RevD.01
frameworkgroup: C1[X(C10H18N2O5)]
method: RPBEPBE
basis: SDD
operation: Freq
keyword: #p
keyword: freq=noraman
keyword: PBEPBE/SDD
title: #p freq=noraman PBEPBE/SDD
converged: YES YES NO NO
title: Mulliken charges:
elementType: O O O O O N N C C C C C C C C C C H H H H H H H H H H H H H H H H H H
charge: -0.265202 -0.279641 -0.250151 -0.437268 -0.309773 -0.429425 -0.414775 -0.156304 -0.163261 -0.079248 -0.089075 0.337770 -0.336955 -0.679062 -0.675050 0.318613 -0.604693 0.258902 0.319341 0.238453 0.257914 0.182866 0.229006 0.292198 0.221386 0.223592 0.237522 0.225088 0.228601 0.226596 0.355830 0.289226 0.280964 0.223505 0.222509
chargesum: 0.00000
title: Mulliken charges with hydrogens summed into heavy atoms:
elementType: O O O O O N N C C C C C C C C C C
charge: -0.265202 -0.279641 -0.250151 -0.081437 -0.309773 -0.137227 -0.125549 0.102597 0.156080 0.159204 0.168839 0.337770 0.074917 0.003438 0.005235 0.318613 0.122285
polarizability: 1.74818126e+02 -1.02247180e+00 1.24105368e+02 -5.40942799e+00 1.54548644e+00 1.14873214e+02
1716.lowfreq: -11.3361 -6.2507 -0.0008 -0.0007 0.0005 2.8128 19.0003 25.8530 47.2823
frequency: 18.9637 25.7718 47.2156 56.0748 69.5861 82.6781 117.2468 127.7075 145.2409 160.5665 171.9844 198.2545 233.0632 241.8253 274.9156 298.6442 310.9050 325.2708 359.6855 391.9307 396.5833 442.8528 453.3256 468.3683 498.9787 545.0974 572.4257 613.7520 624.7148 652.9836 710.4212 729.6511 756.4540 771.3792 779.3390 817.2964 845.1776 902.0521 920.1897 924.1624 934.4121 953.4587 965.0974 977.4002 986.6005 1000.5443 1028.7007 1048.2709 1085.3020 1114.5481 1127.8315 1132.6579 1140.3885 1171.3687 1189.8714 1192.3288 1207.7502 1220.7599 1243.9554 1256.4281 1261.8775 1270.4584 1295.7610 1300.1878 1320.2556 1324.5838 1350.2481 1380.5571 1390.7521 1393.9556 1422.7466 1450.0929 1452.7140 1453.9600 1456.1418 1469.7478 1471.6026 1476.5375 1488.7528 1524.6262 1638.6588 2972.7360 2973.7358 2995.7626 3005.6862 3023.1197 3042.0331 3050.0036 3081.9835 3083.3486 3086.0712 3098.0550 3102.3593 3109.6376 3111.2955 3115.1594 3540.3277 3547.5050 3559.7220
redmass: 4.6097 3.9028 3.9917 4.3144 3.9681 6.0775 4.3909 1.1625 2.9519 3.2485 1.0423 2.8830 1.2270 3.1866 3.9191 3.2656 3.2196 3.7013 1.2410 3.5868 3.4876 1.1656 4.0149 3.5982 3.9112 1.2301 3.6865 5.5132 5.2436 5.5196 9.7958 5.9659 3.4243 4.9188 4.1763 4.2692 3.3711 3.9079 1.6396 4.2361 2.3390 2.3407 3.2422 2.9059 1.6062 3.7664 2.8351 2.8198 4.5652 1.8463 1.2735 1.5364 1.9073 2.1158 1.5080 1.7739 2.3692 1.6290 1.9189 1.7060 1.6224 1.4117 1.4276 1.3421 1.3571 1.2181 1.2582 1.2859 1.3560 1.2491 1.1697 1.0487 1.0504 1.3858 1.1169 1.0697 1.0490 1.4618 1.0452 1.6476 5.2623 1.0657 1.0370 1.0353 1.0356 1.0841 1.0877 1.1028 1.0900 1.0910 1.0905 1.1003 1.1004 1.0972 1.0998 1.1008 1.0771 1.0658 1.0771
irintensity: 2.9592 3.1069 6.8082 5.2509 1.6298 3.4146 6.8589 0.0784 8.4150 1.9381 0.0484 0.6912 0.4466 1.3107 3.8212 0.1118 6.8277 26.3311 1.9999 8.9833 3.5102 177.0947 4.4603 14.1184 10.5110 224.2921 4.2294 44.3215 0.1636 1.2574 9.7637 19.9597 1.5374 13.4163 59.1033 15.6570 11.0839 247.0650 1.1014 23.9899 8.6439 69.1257 63.2644 30.1324 17.7538 129.2863 41.1710 11.0772 5.6428 12.4558 0.0088 47.0488 54.3738 30.7919 6.4335 57.5739 120.4003 93.5564 66.5590 40.0210 58.0219 31.6035 10.9265 9.3043 26.6783 13.1820 21.2784 41.0589 21.2234 28.4291 34.3211 0.3572 5.5234 11.5088 0.9636 2.8028 15.6955 308.2079 15.0386 334.7247 178.3564 94.9226 62.9522 11.5015 10.8838 22.6969 25.5471 43.1458 12.5195 46.4300 3.3718 28.6978 2.3698 1.6061 25.9115 27.6470 11.1940 12.4432 15.0185
temp: 298.150 k
press: 1.00000 atm
elementType: 8 8 8 8 8 7 7 6 6 6 6 6 6 6 6 6 6 1 1 1 1 1 1 1 1 1 1 1 1 1 1 1 1 1 1
symmnumber: 1
zpe: 748582.2 jmol-1
zpe.correction: 0.285120 hartree
zpe.thermalcorrener: 0.303731 hartree
zpe.thermalcorrenthalpy: 0.304675 hartree
zpe.thermalcorrgfe: 0.236493 hartree
zpe.sumelectzpe: -876.126578 hartree
zpe.sumelectthermal: -876.107967 hartree
zpe.sumelectthermalent: -876.107023 hartree
zpe.sumelectthermalfe: -876.175205 hartree
dipole: -1.2182 -1.8657 3.9957
dipole: 4.5750
quadrupole: -85.7745 -114.6555 -102.2208
quadrupole: -7.0197 -14.9167 -2.8391
quadrupole: 15.1091 -13.7719 -1.3372 -7.0197 -14.9167 -2.8391
hfenergy: -876.411698 hartree
pointgroup: C01 [X(C10H18N2O5)]
dipole: 0.4745229 -0.6951385 -1.5910213 debye
polarizability: 174.5827403|2.2902286|124.237112|-6.1582724|-1.542256|114.9768554 unknown
InChI: InChI=1S/C10H18N2O5/c1-10(2)16-7-6(12-9(14)11-3)5(4-13)15-8(7)17-10/h5-8,11-13H,4H2,1-3H3
charge 0 multiplicity 1
35 atoms
O  -0.836874 1.40846 -1.049059
O  -1.601468 -1.145718 0.767081
O  -2.746697 -0.109753 -1.025173
O  -0.236869 3.877727 0.354356
O  2.919615 -1.136348 1.270809
N  1.747771 0.025901 -0.389439
N  4.019672 -0.505472 -0.700454
C  -0.584526 -0.868459 -0.262303
C  0.499819 0.045736 0.373514
C  -1.324853 0.046839 -1.294294
C  -0.213338 1.416839 0.322905
C  -2.945602 -1.009064 0.15713
C  0.619935 2.690193 0.418157
C  -3.860666 -0.322923 1.166453
C  -3.455534 -2.366113 -0.343909
C  2.903251 -0.576218 0.131224
C  5.306214 -1.079432 -0.294686
H  -0.166913 -1.798888 -0.684052
H  0.728306 -0.29226 1.397248
H  -1.157561 -0.150465 -2.364046
H  -1.021944 1.438873 1.078023
H  1.385668 2.709491 -0.384453
H  1.128383 2.740171 1.395228
H  1.758398 0.4908 -1.298919
H  -4.866058 -0.187331 0.733614
H  -3.944856 -0.93677 2.079366
H  -3.4535 0.665449 1.434359
H  -3.617465 -3.048796 0.507794
H  -4.407817 -2.235017 -0.885686
H  -2.723807 -2.825872 -1.030772
H  -0.807504 3.790702 -0.452786
H  3.956272 -0.037105 -1.604567
H  5.165202 -1.52357 0.703616
H  6.09427 -0.305703 -0.23065
H  5.636173 -1.871902 -0.992526
