program: Gaussian 09
title: 000290109
version: EM64L-G09RevD.01
frameworkgroup: C1[X(C12H15N5O5S)]
method: RPBEPBE
basis: SDD
operation: Freq
keyword: #p
keyword: freq=noraman
keyword: PBEPBE/SDD
title: #p freq=noraman PBEPBE/SDD
converged: NO YES NO NO
title: Mulliken charges:
elementType: S O O O O O N N N N N C C C C C C C C C C C C H H H H H H H H H H H H H H H
charge: 0.286313 -0.280781 -0.457534 -0.431898 -0.289778 -0.278241 -0.205426 -0.042070 -0.043294 0.004162 -0.615357 -0.175095 -0.128825 -0.096189 -0.139595 -0.352075 0.127998 -0.222545 0.115020 -0.360524 0.309246 -0.379693 -0.822527 0.300392 0.293522 0.285022 0.302843 0.257220 0.274848 0.365862 0.351272 0.305272 0.248381 0.340508 0.343655 0.282545 0.282871 0.244499
chargesum: 0.00000
title: Mulliken charges with hydrogens summed into heavy atoms:
elementType: S O O O O O N N N N N C C C C C C C C C C C C
charge: 0.286313 -0.280781 -0.091673 -0.080626 -0.289778 -0.278241 -0.205426 -0.042070 -0.043294 0.004162 0.068806 0.125297 0.164696 0.188833 0.163248 0.179992 0.127998 0.082727 0.115020 -0.360524 0.309246 -0.131313 -0.012612
polarizability: 3.01850909e+02 -3.33648603e+00 1.87806746e+02 1.04522347e+01 3.72407917e+00 1.19726403e+02
1716.lowfreq: -8.2147 -6.9161 -0.0019 -0.0017 -0.0014 4.1788 7.4954 24.5138 33.0826
frequency: 1.1360 24.4994 32.9416 43.1478 51.6432 66.7241 75.4242 89.3346 103.6137 108.4853 131.7388 156.0987 162.9075 170.5173 213.9336 243.5512 249.6227 267.0903 283.1537 305.6215 309.7674 313.7131 328.5176 364.5842 373.7151 404.9989 427.4847 487.3105 507.9002 518.8549 529.2318 536.6057 553.5001 609.7373 624.0546 633.1031 637.0144 654.4041 663.1200 702.8348 706.3309 739.2381 783.0525 787.6298 792.5267 822.9642 832.5681 855.1132 884.0292 908.4419 920.4040 921.7333 969.1331 977.6784 990.7694 1001.1820 1006.9128 1020.4322 1027.5435 1057.2554 1084.9231 1090.6242 1097.2500 1117.0766 1150.0003 1178.0738 1179.5486 1204.8700 1224.0434 1256.1498 1263.4571 1267.7365 1283.1009 1289.2960 1294.5835 1301.8839 1307.7959 1329.6780 1340.7271 1344.5495 1362.9355 1363.9741 1378.9907 1389.8796 1392.8537 1430.0300 1433.6355 1447.7935 1455.4747 1513.9049 1536.8337 1589.1947 1694.3315 3027.2494 3030.3902 3046.8855 3063.8234 3068.0739 3115.0340 3133.7872 3152.7807 3159.6576 3170.4466 3255.6806 3539.3519 3557.7618 3571.1484 3714.8417
redmass: 6.6503 6.2765 6.6722 7.1652 5.4205 5.3487 4.7962 3.2086 1.4946 3.9786 6.1642 4.8068 7.0015 7.8364 5.3798 5.5720 5.0766 5.7179 2.9660 1.7699 1.8100 2.5468 1.7807 3.4912 5.7324 10.9311 4.9075 3.7546 1.1848 1.1988 3.0340 4.4965 7.1790 8.2856 7.7165 5.9993 5.6455 7.6469 8.0005 8.3670 8.9318 4.4945 5.7696 5.0477 7.2415 9.8042 2.7191 1.4064 3.7753 5.5674 2.5349 1.6575 3.1279 1.1806 1.3113 3.4582 6.0333 4.9666 5.3800 1.9974 1.5407 3.4755 3.9522 6.3373 1.3857 3.2233 1.8583 1.3349 1.4777 1.3530 1.6105 1.5721 2.0307 3.9991 2.4126 2.0376 2.3148 1.6563 1.3710 1.1398 4.9120 1.3679 1.3566 1.4046 1.5845 4.2962 1.0524 1.0558 1.0950 9.5670 10.5891 1.2047 7.4474 1.0282 1.0872 1.0588 1.0862 1.0886 1.0882 1.1081 1.1043 1.1056 1.0923 1.0987 1.0664 1.0446 1.0667 1.1058
irintensity: 0.1699 0.4171 1.3718 1.4800 6.0485 6.6290 2.6417 0.8063 1.0572 0.7984 3.1982 2.5995 2.0440 7.8130 15.9709 0.8232 1.9750 3.8658 4.5998 95.3759 37.0439 93.9214 86.6147 18.3630 7.3235 0.5632 10.0340 11.6664 212.2710 120.1886 13.5918 1.2069 9.9581 1.4016 1.3721 3.8946 17.7899 2.7677 1.1286 14.0801 40.5463 29.0188 34.6266 38.0883 15.5970 7.1577 33.4628 17.1477 24.9995 68.6966 40.8269 29.4438 43.9477 6.9257 12.3434 91.3909 50.9519 308.6665 90.8870 19.0701 19.0108 33.6486 19.6920 43.5214 7.9290 158.7630 67.9664 60.5934 5.0026 19.5282 2.3624 14.6139 23.3782 43.5122 133.3518 33.6853 288.3743 49.4564 31.5786 2.3090 26.4774 2.4022 32.4179 45.0070 32.7072 49.9016 14.6304 31.1173 27.1810 185.5948 135.0171 102.9107 352.2841 21.8372 14.1879 12.1314 6.9420 8.9771 4.0821 0.9060 7.5404 9.2575 13.5332 5.4254 12.1437 78.5378 14.1710 54.2054
temp: 298.150 k
press: 1.00000 atm
elementType: 16 8 8 8 8 8 7 7 7 7 7 6 6 6 6 6 6 6 6 6 6 6 6 1 1 1 1 1 1 1 1 1 1 1 1 1 1 1
symmnumber: 1
zpe: 736712.4 jmol-1
zpe.correction: 0.280599 hartree
zpe.thermalcorrener: 0.303205 hartree
zpe.thermalcorrenthalpy: 0.304149 hartree
zpe.thermalcorrgfe: 0.223349 hartree
zpe.sumelectzpe: -1512.483565 hartree
zpe.sumelectthermal: -1512.460959 hartree
zpe.sumelectthermalent: -1512.460015 hartree
zpe.sumelectthermalfe: -1512.540814 hartree
dipole: -1.3547 3.7333 0.8867
dipole: 4.0693
quadrupole: -110.4669 -145.8420 -143.8237
quadrupole: 0.6825 -9.6220 -5.2928
quadrupole: 22.9106 -12.4645 -10.4462 0.6825 -9.6220 -5.2928
hfenergy: -1512.7641638 hartree
pointgroup: C01 [X(C12H15N5O5S1)]
dipole: 0.5381637 1.5076647 0.0213055 debye
polarizability: 301.2976865|0.068843|185.6852885|14.8591675|12.3553729|122.4010832 unknown
InChI: InChI=1S/C12H15N5O5S/c1-23-10-6-9(14-3-15-10)17(4-16-6)11-8(19)7(18)5(22-11)2-21-12(13)20/h3-5,7-8,11,18-19H,2,13H2,1H3
charge 0 multiplicity 1
38 atoms
S  -5.650966 -1.419416 -0.781126
O  1.413844 -0.821333 1.027142
O  1.570351 2.37751 0.847345
O  1.297512 0.098737 -2.048588
O  4.878426 0.285939 0.031272
O  5.363762 -2.026938 0.002363
N  -0.87675 -0.406243 0.515356
N  -2.423796 -1.995712 -0.09054
N  -2.330446 1.604741 0.503547
N  -4.636043 1.060238 -0.128955
N  6.686208 -0.450505 -1.13462
C  0.876647 1.349813 0.070111
C  1.917691 0.640329 -0.835675
C  0.382826 0.208069 1.01119
C  2.516405 -0.451208 0.071625
C  3.722299 0.006654 0.912977
C  -2.085284 0.272482 0.342727
C  -1.144081 -1.765311 0.258412
C  -3.032983 -0.729075 -0.040967
C  -4.355252 -0.267175 -0.281868
C  5.633792 -0.851384 -0.34592
C  -3.635402 1.916294 0.249664
C  -7.103491 -0.231565 -0.936862
H  0.054021 1.776638 -0.527356
H  2.678548 1.348122 -1.192978
H  0.21893 0.57451 2.040643
H  2.772833 -1.363467 -0.493137
H  3.982396 -0.785003 1.635433
H  3.515032 0.960989 1.419228
H  0.901742 3.005345 1.220483
H  0.653437 -0.618075 -1.811536
H  -0.369221 -2.520308 0.359888
H  -3.918235 2.96702 0.358438
H  6.822473 0.533513 -1.353041
H  7.322225 -1.156093 -1.494942
H  -6.881867 0.527957 -1.698832
H  -7.290608 0.255443 0.029759
H  -7.956975 -0.85853 -1.237655
