program: Gaussian 09
title: 000290103
version: EM64L-G09RevD.01
frameworkgroup: C1[X(C12H19NO4)]
method: RPBEPBE
basis: SDD
operation: Freq
keyword: #p
keyword: freq=noraman
keyword: PBEPBE/SDD
title: #p freq=noraman PBEPBE/SDD
converged: YES YES NO NO
title: Mulliken charges:
elementType: O O O O N C C C C C C C C C C C C H H H H H H H H H H H H H H H H H H H
charge: -0.283470 -0.220718 -0.414266 -0.234048 -0.611927 0.328269 0.128649 -0.112230 -0.528807 -0.470937 -0.408657 -0.411763 -0.459677 -0.752765 0.125400 -0.501751 0.171353 0.208172 0.247759 0.206835 0.202942 0.227681 0.224839 0.207966 0.197259 0.210673 0.228937 0.231643 0.215978 0.231142 0.255632 0.264657 0.257802 0.337740 0.320561 0.379127
chargesum: 0.00000
title: Mulliken charges with hydrogens summed into heavy atoms:
elementType: O O O O N C C C C C C C C C C C C
charge: -0.283470 -0.220718 -0.035139 -0.234048 0.046374 0.328269 0.128649 0.095942 -0.074213 -0.040314 0.024148 -0.003831 0.000902 -0.050013 0.125400 0.020708 0.171353
polarizability: 1.61862806e+02 4.06145890e+00 1.42658954e+02 7.32250949e-01 4.63625816e+00 1.21221917e+02
1716.lowfreq: -11.4405 -4.2621 -0.0003 0.0007 0.0010 6.6189 20.0333 31.6339 35.0808
frequency: 19.9950 31.6093 35.0549 49.8231 70.7062 87.1979 110.7823 125.7483 148.3017 162.7337 202.2050 223.6892 240.0688 261.1742 291.2966 313.1151 354.6065 363.0069 412.1991 451.8450 465.6404 480.2856 498.7519 502.6487 515.5799 542.3107 581.8558 594.7247 615.8779 645.0152 681.8419 695.4356 734.9021 765.7306 796.3327 804.3185 834.3397 856.9155 874.5822 883.6844 907.3967 943.1960 990.8273 1006.0867 1028.2827 1040.8385 1044.2872 1067.6584 1076.5947 1081.8782 1100.0584 1117.4838 1130.1022 1141.0468 1155.1667 1183.0305 1229.0113 1232.3846 1251.8652 1267.9692 1275.6843 1279.4249 1309.5398 1321.1059 1325.3951 1330.4718 1340.5698 1345.8174 1354.0224 1372.8290 1388.9358 1401.4361 1438.3199 1453.4432 1457.6310 1465.5166 1468.0208 1473.9605 1478.3457 1483.1896 1593.2465 1643.0033 1664.4256 2971.0868 2974.2768 2979.8936 2986.7547 2988.0044 2989.4135 2995.8282 2997.7280 3031.8704 3038.8340 3041.6075 3049.3631 3058.2659 3065.4452 3078.4696 3105.0854 3508.3480 3510.2344 3663.6946
redmass: 10.8813 5.9526 5.4299 4.9107 2.1620 3.2200 4.1343 3.6309 1.1087 2.6565 3.2231 3.9628 4.1433 2.7802 3.0250 2.5661 4.0221 3.3381 3.1039 2.5080 3.1767 3.0765 2.3482 1.1715 2.3503 3.1211 1.3284 3.5479 3.1473 1.3442 3.9031 2.7542 5.1276 1.6854 2.1017 2.0244 2.5836 3.3509 2.4806 2.5565 1.7387 2.2128 2.1966 1.8197 2.4411 1.8797 2.3064 2.0094 1.8984 2.0549 1.5716 1.7859 1.9534 2.0785 1.8878 1.4375 1.5268 1.5523 1.5775 1.5195 1.2924 1.2597 1.7423 1.9928 1.7807 1.5851 1.4534 1.6486 1.4790 1.7850 1.2173 2.3987 1.0832 1.1007 1.1051 1.0838 1.0885 1.0683 1.0923 1.0857 1.4030 4.0785 8.1377 1.0634 1.0648 1.0660 1.0643 1.0611 1.0392 1.0651 1.0722 1.0961 1.1017 1.0950 1.0996 1.0996 1.0993 1.0983 1.0989 1.0446 1.0639 1.1044
irintensity: 0.2704 7.4470 5.3898 3.3819 0.6515 0.5400 1.8564 0.2856 0.2186 0.3445 0.1324 0.7808 2.2351 1.0354 3.2847 0.7634 0.8989 1.3832 3.8553 9.6841 24.3427 4.6817 4.6209 139.8534 11.1305 24.4171 113.4634 8.6669 43.9333 129.6786 1.2253 1.3844 13.2293 10.6061 10.1044 8.2666 7.7737 1.1572 2.9280 3.1975 2.5764 8.7621 43.7349 16.3475 20.7237 79.7471 121.5168 13.9224 1.8537 55.3286 4.9873 0.0891 10.6270 16.5226 18.1767 3.9731 11.0630 13.5675 6.7838 4.1991 11.5472 1.9474 46.4336 34.5326 35.9584 21.7272 1.4480 2.5340 4.6406 24.9617 18.3855 1.4990 24.5882 16.7687 14.6214 9.1675 7.0928 12.5684 20.5177 9.1902 72.2766 258.3107 199.2311 33.1307 16.6901 18.2065 4.9580 36.3171 7.9954 11.8059 53.2690 57.0331 51.0100 8.3698 33.5752 29.2266 43.3501 14.3198 20.7941 26.5735 22.2867 25.3465
temp: 298.150 k
press: 1.00000 atm
elementType: 8 8 8 8 7 6 6 6 6 6 6 6 6 6 6 6 6 1 1 1 1 1 1 1 1 1 1 1 1 1 1 1 1 1 1 1
symmnumber: 1
zpe: 783671.5 jmol-1
zpe.correction: 0.298485 hartree
zpe.thermalcorrener: 0.316666 hartree
zpe.thermalcorrenthalpy: 0.317610 hartree
zpe.thermalcorrgfe: 0.250292 hartree
zpe.sumelectzpe: -822.987454 hartree
zpe.sumelectthermal: -822.969272 hartree
zpe.sumelectthermalent: -822.968328 hartree
zpe.sumelectthermalfe: -823.035646 hartree
dipole: 5.2748 -0.7433 -1.6119
dipole: 5.5654
quadrupole: -120.5969 -96.3576 -99.3202
quadrupole: 2.1901 8.5282 -1.0973
quadrupole: -15.1720 9.0673 6.1047 2.1901 8.5282 -1.0973
hfenergy: -823.2859384 hartree
pointgroup: C01 [X(C12H19N1O4)]
dipole: 2.0739705 0.3206009 0.6246902 debye
polarizability: 161.998878|-3.6250161|142.3162534|-1.2078857|5.0649657|121.4285462 unknown
InChI: InChI=1S/C12H19NO4/c1-11(10(13)16)12(17-11)7-3-2-4-8(12)5-6-9(14)15/h8,14H,2-7,13H2,1H3
charge 0 multiplicity 1
36 atoms
O  -2.133187 -0.543582 -1.255643
O  -4.174779 1.044143 0.205581
O  5.124356 0.854467 -0.159484
O  3.479951 1.938685 1.067831
N  -2.450414 2.015766 1.42273
C  -1.014908 -0.431749 -0.221703
C  -1.848863 0.778382 -0.599468
C  0.400107 -0.632428 -0.783054
C  -1.314718 -1.191238 1.070613
C  0.682679 -2.157286 -0.915354
C  -1.002229 -2.700141 0.910744
C  0.440218 -2.929706 0.40278
C  1.430748 0.137796 0.088429
C  -1.381173 1.881032 -1.543773
C  -2.942807 1.259317 0.367092
C  2.858372 0.109402 -0.489494
C  3.793223 1.060326 0.233832
H  0.430752 -0.200994 -1.802848
H  -2.375987 -1.053241 1.34324
H  -0.705586 -0.769129 1.896375
H  1.71467 -2.323876 -1.279544
H  0.004745 -2.561242 -1.69291
H  -1.719104 -3.134088 0.186589
H  -1.161033 -3.216587 1.87631
H  1.165052 -2.607387 1.178323
H  0.616664 -4.009731 0.238183
H  1.113879 1.194694 0.178801
H  1.451608 -0.264672 1.118212
H  -0.963275 2.741495 -0.989616
H  -0.623088 1.512572 -2.252771
H  -2.244565 2.243574 -2.129698
H  3.304287 -0.90104 -0.455513
H  2.854439 0.399574 -1.560158
H  -3.113041 2.423372 2.082718
H  -1.451565 2.14567 1.578443
H  5.711172 1.505647 0.313504
