program: Gaussian 09
title: 000290101
version: EM64L-G09RevD.01
frameworkgroup: C1[X(C20H29NO3)]
method: RPBEPBE
basis: SDD
operation: Freq
keyword: #p
keyword: freq=noraman
keyword: PBEPBE/SDD
title: #p freq=noraman PBEPBE/SDD
converged: NO YES NO NO
title: Mulliken charges:
elementType: O O O N C C C C C C C C C C C C C C C C C C C C H H H H H H H H H H H H H H H H H H H H H H H H H H H H H
charge: -0.461484 -0.317598 -0.274994 -0.080967 0.251571 -0.166438 -0.520704 -0.463737 -0.442641 -0.056283 0.147698 -0.458543 -0.273801 0.405055 -0.402502 -0.421818 0.015371 -0.500495 0.216191 -0.386610 -0.621809 -0.623425 -0.502299 -0.534602 0.206108 0.268413 0.204069 0.201116 0.233632 0.230859 0.207676 0.195581 0.187122 0.207893 0.225775 0.217971 0.226142 0.227129 0.326591 0.233201 0.241252 0.215521 0.227096 0.185224 0.229076 0.214897 0.184466 0.205778 0.242420 0.241795 0.225413 0.242869 0.219780
chargesum: 0.00000
title: Mulliken charges with hydrogens summed into heavy atoms:
elementType: O O O N C C C C C C C C C C C C C C C C C C C C
charge: -0.134892 -0.317598 -0.274994 -0.080967 0.251571 0.039670 -0.048221 -0.028989 -0.004107 0.139298 0.147698 -0.063529 -0.048026 0.405055 0.041610 -0.194689 0.015371 -0.267294 0.216191 -0.145358 0.006032 0.005014 0.187694 0.153459
polarizability: 2.73612336e+02 4.74324593e+00 1.97064572e+02 -1.02730035e+01 3.56695590e+00 2.35689570e+02
1716.lowfreq: -14.8476 -4.0939 -0.0005 -0.0004 0.0003 3.3960 14.4151 35.8049 45.2375
frequency: 10.9233 35.6934 45.2215 53.5649 73.3917 79.1450 95.9342 99.9300 103.3037 119.1861 129.1875 179.7578 186.6895 193.7534 216.3355 226.9014 229.9051 240.2469 246.8379 259.7630 275.2849 285.9004 291.0219 308.1364 312.3272 333.3436 339.9285 369.2899 380.5872 386.6976 418.6175 438.8352 447.6417 471.1438 481.4288 491.4546 504.2160 532.6307 557.5487 578.3900 616.4658 631.0531 669.3651 690.9745 732.3931 743.5119 769.7609 786.9371 792.5933 814.9943 822.2853 842.4935 859.0829 884.6671 908.0336 924.0633 941.8510 949.3684 961.0712 974.8185 994.6629 1013.8852 1020.3287 1028.5785 1032.6369 1035.9778 1054.1322 1069.2577 1079.8336 1084.9121 1094.7864 1102.2820 1111.3350 1112.6778 1122.0642 1134.6079 1143.5542 1148.2633 1152.1141 1166.8339 1174.9895 1186.4692 1202.8458 1206.5665 1227.7205 1235.1716 1253.5862 1254.9275 1260.7090 1274.1444 1281.6683 1304.6245 1307.1964 1311.1660 1314.8443 1333.1009 1338.5464 1358.8946 1359.5056 1384.4787 1390.9350 1393.6783 1406.9069 1417.6549 1433.0174 1439.4741 1440.2919 1453.3746 1454.6202 1456.9583 1461.0037 1461.6820 1462.4977 1466.2562 1467.8685 1469.2161 1472.5014 1474.7025 1477.0246 1478.3097 1486.1488 1560.3321 1597.3322 1651.0534 2839.1892 2851.3729 2880.2995 2936.0612 2959.8075 2961.0130 2967.9138 2978.4442 2980.4783 2982.9468 2984.3382 3013.5914 3023.3061 3023.3707 3033.8677 3043.7580 3048.1183 3058.4854 3073.6820 3083.4456 3088.3193 3103.1458 3112.5036 3122.9465 3123.3394 3127.4327 3134.2718 3164.1815 3545.8115
redmass: 2.7374 3.4144 3.7070 4.3713 2.8158 3.0429 3.5273 1.3412 2.3527 3.8399 3.0793 3.3485 3.2040 3.2917 2.1973 2.4807 1.2295 1.8264 1.5004 1.4876 2.3192 3.6840 1.8723 1.9272 2.7843 3.8122 2.4568 3.0521 4.7018 4.5255 3.0559 2.3558 3.9371 2.2284 3.9251 3.0808 3.6311 3.8091 3.6424 4.9001 3.5354 4.3265 4.0846 5.9918 1.7397 3.4573 1.7002 2.6488 1.9302 1.8493 3.7456 3.0904 2.0623 2.8491 3.0636 1.3845 2.3563 3.0670 1.3627 3.4142 2.9368 2.4684 5.1460 1.9066 1.8438 2.4534 2.2695 2.1585 1.9946 1.6126 1.8363 1.3742 1.2658 2.0346 2.2201 1.5017 1.4235 1.4715 1.5082 1.9259 1.2657 1.5532 1.4481 2.1743 1.5743 1.6965 3.4838 1.7901 1.7130 1.6022 1.3374 1.2091 1.2560 1.2844 1.3902 1.3745 1.4619 2.1246 2.6663 1.4113 1.8168 1.6806 2.2687 1.1448 1.3009 1.2077 1.2935 1.3304 1.0799 1.1774 1.4400 1.0605 1.1214 1.0586 1.0698 1.0682 1.0909 1.0666 1.1211 1.0854 1.0573 6.1136 7.3030 7.0052 1.0573 1.0581 1.0686 1.0824 1.0329 1.0597 1.0810 1.0648 1.0307 1.0632 1.0676 1.0720 1.0914 1.0810 1.0881 1.1023 1.1039 1.0976 1.1004 1.0995 1.1017 1.0848 1.1060 1.0992 1.0904 1.0896 1.0996 1.0944 1.0658
irintensity: 0.1846 0.6979 0.4326 0.1939 1.4560 2.7418 2.8436 0.6150 1.8283 3.4515 6.2637 3.5816 1.1251 2.0291 1.0384 0.2520 0.9242 1.1926 1.3254 1.3571 0.3921 6.9183 45.0768 50.3215 11.5104 14.5845 5.1661 11.0630 0.6167 2.5099 1.4305 0.4915 4.1670 1.1308 1.1658 12.9637 4.6043 2.6158 2.2957 8.6697 15.2165 0.6271 13.1133 5.3821 8.4621 5.2604 4.3939 3.3005 7.4070 50.4962 29.7712 1.8682 9.8911 17.0609 27.3997 0.9372 12.5278 8.8217 2.1442 28.6320 29.9961 30.9274 77.4893 39.1111 58.8150 29.1447 25.0898 3.5509 16.2993 6.8536 14.5755 1.5805 0.4494 14.7797 13.6585 7.4940 4.1921 3.3915 0.3186 19.4676 8.5518 9.0076 17.3505 11.5932 17.3303 20.4598 202.7271 10.6531 7.7838 15.7692 0.3491 7.8266 5.1867 4.0089 8.8770 2.9920 13.6527 28.0842 0.2170 11.6852 21.2821 3.5481 26.4454 2.0292 8.0042 12.4767 18.9724 30.5240 3.0371 13.3501 54.7655 13.3560 21.8984 10.5756 6.1333 10.3223 29.1775 16.9130 8.0758 20.8265 23.8160 22.8314 24.9952 1.2041 63.0185 139.5390 89.1515 42.3741 93.9925 46.3860 11.9066 9.7749 63.1358 28.8590 76.6354 50.1575 66.8012 24.2041 3.4665 60.7331 43.9396 38.8580 43.2927 44.5657 37.7355 3.0059 18.1870 24.8280 6.3674 3.0401 47.5922 19.6631 2.0805
temp: 298.150 k
press: 1.00000 atm
elementType: 8 8 8 7 6 6 6 6 6 6 6 6 6 6 6 6 6 6 6 6 6 6 6 6 1 1 1 1 1 1 1 1 1 1 1 1 1 1 1 1 1 1 1 1 1 1 1 1 1 1 1 1 1
symmnumber: 1
zpe: 1185128.7 jmol-1
zpe.correction: 0.451392 hartree
zpe.thermalcorrener: 0.476335 hartree
zpe.thermalcorrenthalpy: 0.477279 hartree
zpe.thermalcorrgfe: 0.396674 hartree
zpe.sumelectzpe: -1058.030625 hartree
zpe.sumelectthermal: -1058.005682 hartree
zpe.sumelectthermalent: -1058.004737 hartree
zpe.sumelectthermalfe: -1058.085342 hartree
dipole: 3.2989 -2.5239 1.5639
dipole: 4.4383
quadrupole: -126.4619 -138.4698 -144.2440
quadrupole: 2.7772 -3.0890 3.2628
quadrupole: 9.9300 -2.0779 -7.8521 2.7772 -3.0890 3.2628
hfenergy: -1058.4820166 hartree
pointgroup: C01 [X(C20H29N1O3)]
dipole: -0.4052344 1.5736168 0.6392077 debye
polarizability: 252.8440768|-35.5423009|218.7711135|4.9595289|-5.2174302|234.7512878 unknown
InChI: InChI=1S/C20H29NO3/c1-21(2)12-11-20-13-16(22)9-8-15(20)7-5-14-6-10-17(23-3)19(24-4)18(14)20/h5-7,10,15-16,22H,8-9,11-13H2,1-4H3
charge 0 multiplicity 1
53 atoms
O  2.666757 0.687703 -3.186012
O  -0.952496 0.754775 -1.670609
O  -2.777108 2.491448 -0.608479
N  -1.421765 -3.76511 -0.4706
C  1.054757 -0.727015 -0.005003
C  2.357343 -0.714181 0.883994
C  1.530614 -0.584991 -1.484401
C  3.271232 0.523744 0.608328
C  0.380719 -2.138247 0.171856
C  2.37244 0.670338 -1.735334
C  0.056618 0.349209 0.514446
C  3.652058 0.648786 -0.883709
C  2.048758 -0.750798 2.367077
C  -0.002462 0.563103 1.939199
C  -0.870084 -2.400291 -0.691983
C  0.943575 -0.112297 2.841255
C  -0.890848 1.034395 -0.293674
C  -0.9656 1.436909 2.494631
C  -1.863087 1.913142 0.291363
C  -1.891095 2.121853 1.685061
C  -2.32543 -4.170645 -1.567464
C  -2.079014 -3.919192 0.843905
C  -0.917271 1.878546 -2.632213
C  -3.828212 3.339989 -0.044105
H  2.932134 -1.620993 0.600356
H  0.678336 -0.584839 -2.175283
H  2.161552 -1.467121 -1.719469
H  4.183256 0.445121 1.230436
H  2.738971 1.436746 0.941172
H  0.133633 -2.267489 1.241493
H  1.131898 -2.913724 -0.080148
H  1.782906 1.576639 -1.470563
H  4.251791 1.568641 -1.046947
H  4.272562 -0.214158 -1.19848
H  2.768743 -1.220479 3.048492
H  -1.64231 -1.614216 -0.504229
H  -0.598838 -2.32785 -1.760538
H  0.741519 -0.055568 3.91865
H  3.312138 1.41847 -3.367278
H  -0.984857 1.584232 3.58072
H  -2.630755 2.785941 2.141096
H  -2.657131 -5.213461 -1.410373
H  -1.786188 -4.123953 -2.530359
H  -3.239575 -3.527757 -1.652804
H  -1.365599 -3.713537 1.65944
H  -2.43175 -4.960154 0.959532
H  -2.959055 -3.236771 0.974654
H  -0.376798 2.746937 -2.212211
H  -1.942916 2.178986 -2.898176
H  -0.372004 1.491444 -3.509055
H  -4.459072 2.774631 0.668871
H  -4.434046 3.656875 -0.905881
H  -3.402942 4.229227 0.461052
