program: Gaussian 09
title: 000290097
version: EM64L-G09RevD.01
frameworkgroup: C1[X(C15H22O4)]
method: RPBEPBE
basis: SDD
operation: Freq
keyword: #pfreq=noraman
keyword: PBEPBE/SDD
title: #p freq=noraman PBEPBE/SDD
converged: YES YES NO NO
title: Mulliken charges:
elementType: O O O O C C C C C C C C C C C C C C C H H H H H H H H H H H H H H H H H H H H H H
charge: -0.267784 -0.411013 -0.227068 -0.215573 -0.086130 -0.091165 0.267303 -0.655832 -0.620695 -0.135206 -0.136102 -0.216041 -0.216418 0.175102 0.097545 -0.740692 -0.743117 -0.257695 -0.667247 0.245945 0.258195 0.224706 0.269823 0.225688 0.249354 0.206648 0.208978 0.200276 0.199949 0.227402 0.210869 0.221617 0.212369 0.219592 0.225183 0.382114 0.238355 0.223231 0.220592 0.225048 0.251895
chargesum: 0.00000
title: Mulliken charges with hydrogens summed into heavy atoms:
elementType: O O O O C C C C C C C C C C C C C C C
charge: -0.267784 -0.028899 -0.227068 -0.215573 0.159815 0.167029 0.267303 -0.161303 -0.145653 0.071442 0.072876 -0.015765 -0.016469 0.175102 0.097545 -0.080805 -0.085973 0.203891 0.030288
polarizability: 1.76886216e+02 -4.15722075e+00 1.57223223e+02 3.18947979e+00 6.73381519e+00 1.65630466e+02
1716.lowfreq: -11.3369 -0.0008 -0.0007 -0.0005 2.6307 6.9438 15.9537 24.2634 47.3304
frequency: 15.5651 23.9316 47.2642 56.3757 70.6122 75.5405 87.5641 128.7688 145.4161 186.9653 192.6426 208.8594 223.7047 228.7914 238.4794 262.1482 263.0111 283.5526 309.6810 326.5108 367.1822 398.4517 419.8349 432.4854 458.6832 476.7553 485.4018 514.6270 552.0178 579.5747 606.3102 662.0887 697.8237 718.9081 724.4283 740.2028 758.7501 792.1114 802.2796 815.5413 851.5672 857.2782 877.4794 941.4374 955.1442 968.7581 970.5123 986.9386 1012.4721 1019.1334 1031.5421 1045.6626 1065.7979 1071.3908 1086.7044 1093.2355 1093.7365 1104.7945 1125.6986 1131.7072 1148.6290 1155.6156 1158.5711 1180.8647 1230.4083 1234.5873 1247.1504 1262.4181 1271.4323 1276.8295 1282.0085 1288.1848 1298.8762 1299.8965 1324.2285 1327.6159 1349.4154 1354.0250 1357.0314 1365.7180 1384.5540 1390.1708 1390.5333 1455.9089 1457.8846 1461.6535 1463.5142 1474.3537 1475.1024 1476.3461 1477.6220 1484.1880 1621.7782 1654.7231 1660.4790 2917.7450 2918.7332 2950.6505 2971.6463 2972.8671 2974.3718 2992.9115 2999.5164 3001.8373 3031.7926 3068.4119 3069.4505 3072.2809 3074.3346 3075.5711 3087.7222 3088.3533 3093.4699 3098.3031 3108.0524 3119.8471 3520.8729
redmass: 4.1490 4.7243 3.8892 3.6898 4.8782 3.3821 4.4043 4.0231 4.4251 2.2162 2.2783 1.2739 1.2883 1.3262 2.1655 3.1637 2.8125 2.5597 2.9613 3.6753 5.0836 3.1906 3.9873 3.7453 3.5764 2.4339 3.4705 2.4353 2.8344 1.5391 3.7498 3.2904 4.7766 2.7301 3.9832 3.0506 1.9915 2.4910 2.3949 1.5602 2.1009 2.2548 2.2054 1.4487 1.6396 1.7271 1.3009 3.3797 2.7902 3.0245 3.2156 2.6763 1.8185 1.9473 2.6245 2.6935 2.1945 2.6976 1.6302 2.5885 2.5650 1.6824 1.8179 1.2499 1.4364 1.6055 1.7378 1.2919 1.3597 1.1193 1.3662 1.3626 1.8764 1.3119 1.4564 1.4774 1.8203 1.3602 1.5576 1.4623 1.2121 1.2354 1.2561 1.0952 1.0804 1.0975 1.0446 1.0455 1.0479 1.0565 1.0554 1.0510 10.2833 7.8280 9.3508 1.0806 1.0807 1.0827 1.0773 1.0413 1.0353 1.0359 1.0676 1.0658 1.0594 1.0990 1.0994 1.0993 1.0946 1.0898 1.0975 1.0986 1.1029 1.0966 1.0982 1.1066 1.0641
irintensity: 0.0885 0.8009 0.4809 0.4468 0.3200 0.3853 0.4298 0.6919 1.7461 1.4817 0.1931 1.7185 0.2184 0.2455 0.5046 0.3133 2.4721 3.3561 4.3394 4.0329 5.6412 5.5589 2.2872 1.9086 0.6996 2.1179 11.7174 6.3050 21.4152 97.7083 27.9674 36.9798 4.3431 22.5397 1.8774 5.5293 28.7461 5.5911 2.7233 5.8977 1.2666 0.1398 8.8446 5.5124 3.5213 22.0855 4.3430 60.6020 57.4257 37.0612 15.4221 45.6082 11.4193 34.0708 23.7657 65.5485 73.0490 92.9635 3.9729 35.6444 117.3481 9.9838 52.9249 0.4888 7.3858 23.3802 6.6712 2.8298 4.5870 3.0647 3.3767 1.1527 31.6021 2.2588 7.4675 2.1236 0.2350 1.0341 0.9130 9.8745 1.1455 20.2998 24.7132 17.7971 24.4333 4.1281 13.9009 4.9479 14.1576 6.5834 7.6371 15.9699 191.7892 8.8173 204.4794 8.4184 26.6350 6.1032 18.0137 50.9137 30.1331 16.0001 4.6997 63.5908 29.9857 26.9896 33.4625 49.4708 38.7488 6.7654 40.4604 4.6224 1.4901 13.9556 74.6947 27.0835 29.7737
temp: 298.150 k
press: 1.00000 atm
elementType: 8 8 8 8 6 6 6 6 6 6 6 6 6 6 6 6 6 6 6 1 1 1 1 1 1 1 1 1 1 1 1 1 1 1 1 1 1 1 1 1 1
symmnumber: 1
zpe: 900913.0 jmol-1
zpe.correction: 0.343140 hartree
zpe.thermalcorrener: 0.363157 hartree
zpe.thermalcorrenthalpy: 0.364101 hartree
zpe.thermalcorrgfe: 0.293057 hartree
zpe.sumelectzpe: -884.220745 hartree
zpe.sumelectthermal: -884.200727 hartree
zpe.sumelectthermalent: -884.199783 hartree
zpe.sumelectthermalfe: -884.270827 hartree
dipole: 0.7015 -2.7437 -1.2108
dipole: 3.0799
quadrupole: -114.6475 -111.7329 -110.6317
quadrupole: 5.8850 3.6170 -7.7476
quadrupole: -2.3101 0.6045 1.7056 5.8850 3.6170 -7.7476
hfenergy: -884.5638843 hartree
pointgroup: C01 [X(C15H22O4)]
dipole: 0.3929159 1.0143284 0.5339039 debye
polarizability: 177.9404834|0.5493945|156.0997409|-1.1523228|6.9762918|165.69968 unknown
InChI: InChI=1S/C15H22O4/c1-4-19-14(18)15(13(16)17)7-11-9(2)5-6-10(3)12(11)8-15/h5-6,9-12,16H,4,7-8H2,1-3H3
charge 0 multiplicity 1
41 atoms
O  -1.796102 1.773367 0.201318
O  -2.655325 -1.892607 1.260982
O  -3.239716 0.276146 -0.850929
O  -1.529635 -2.932026 -0.477845
C  1.334615 -0.582447 -0.52684
C  1.161629 0.244617 0.771952
C  -1.078411 -0.534387 0.040947
C  -0.068148 -0.530971 -1.173191
C  -0.198701 -0.237444 1.321772
C  2.51172 -0.06006 -1.377719
C  2.381067 0.090037 1.705335
C  3.716121 0.189906 -0.472114
C  3.662456 0.233668 0.886281
C  -2.172633 0.504849 -0.237458
C  -1.754175 -1.902625 0.191139
C  2.878112 -1.017677 -2.539813
C  2.359305 1.092544 2.886736
C  -2.73391 2.894232 -0.127788
C  -2.457575 3.436429 -1.532377
H  1.558571 -1.633108 -0.239256
H  1.071283 1.315175 0.489055
H  -0.175204 0.41051 -1.745441
H  -0.281914 -1.375244 -1.847992
H  -0.056306 -1.174272 1.894895
H  -0.695342 0.48814 1.983012
H  2.208384 0.913446 -1.827356
H  2.359718 -0.937409 2.136572
H  4.68461 0.324466 -0.976921
H  4.589603 0.396056 1.456328
H  2.020995 -1.16435 -3.222036
H  3.721122 -0.619045 -3.134556
H  3.177164 -2.008113 -2.149081
H  3.242182 0.959323 3.539439
H  2.367134 2.133964 2.514355
H  1.45528 0.957271 3.508205
H  -3.098213 -2.780968 1.329602
H  -3.768519 2.520004 -0.036731
H  -2.526108 3.640347 0.655597
H  -3.101551 4.314602 -1.72482
H  -1.40505 3.75307 -1.634337
H  -2.681235 2.674386 -2.297717
