program: Gaussian 09
title: 000290094
version: EM64L-G09RevD.01
frameworkgroup: C1[X(C13H16O6)]
method: RPBEPBE
basis: SDD
operation: Freq
keyword: #pfreq=noraman
keyword: PBEPBE/SDD
title: #p freq=noraman PBEPBE/SDD
converged: YES YES NO NO
title: Mulliken charges:
elementType: O O O O O O C C C C C C C C C C C C C H H H H H H H H H H H H H H H H
charge: -0.291285 -0.283017 -0.288278 -0.239613 -0.413819 -0.243096 0.374804 -0.515933 0.109960 -0.509285 -0.540446 0.286148 0.243235 0.062619 -0.495245 0.182999 -0.532637 -0.497534 -0.521214 0.273350 0.247273 0.271758 0.291034 0.259459 0.287257 0.228729 0.242194 0.234742 0.205329 0.230110 0.252575 0.207641 0.232291 0.271801 0.376092
chargesum: 0.00000
title: Mulliken charges with hydrogens summed into heavy atoms:
elementType: O O O O O O C C C C C C C C C C C C C
charge: -0.291285 -0.283017 -0.288278 -0.239613 -0.037727 -0.243096 0.374804 0.004690 0.109960 -0.237528 -0.249412 0.286148 0.243235 0.062619 0.051471 0.182999 0.173028 0.190481 0.190520
polarizability: 2.46122321e+02 9.20982883e+00 1.86342371e+02 5.00540325e+00 1.28133668e+00 9.23930512e+01
1716.lowfreq: -2.9837 -0.0007 -0.0001 0.0007 4.7085 7.3979 19.1022 28.3271 45.7899
frequency: 19.0664 28.3114 45.7803 47.4768 62.5774 71.3542 94.4260 103.4958 109.0280 142.6534 157.8612 162.7778 181.9236 188.8051 212.8497 217.4026 241.1426 265.2960 278.0127 306.9785 320.4512 359.6081 382.1972 426.3827 451.5025 482.9734 508.2347 512.1365 537.9723 577.0590 584.1439 636.6445 646.2067 651.7084 677.4846 724.7610 754.9782 802.0649 853.8320 869.2333 871.6722 887.6048 906.1577 947.2075 980.1566 1009.6365 1038.0784 1062.8694 1071.4118 1097.2707 1107.2528 1110.0644 1113.0576 1141.1973 1150.6605 1152.7647 1158.3091 1166.3688 1208.4855 1223.9683 1236.6752 1255.3429 1292.7200 1329.8312 1372.9027 1384.2254 1405.4292 1418.9118 1439.7787 1441.8970 1443.5515 1447.7507 1453.7553 1454.6833 1465.3297 1468.4022 1470.4293 1480.7907 1484.4107 1557.2470 1590.2705 1599.9607 1662.3052 2971.1264 2973.8538 2978.8316 2985.0569 3001.2246 3040.1174 3063.7791 3074.9745 3088.6789 3090.4422 3127.0240 3128.7047 3133.4039 3169.7656 3174.5145 3511.7378
redmass: 6.8695 7.2782 5.1934 3.1336 4.8758 4.0740 3.6108 2.1108 2.1555 2.4507 2.3533 2.0944 2.0939 2.0003 3.8119 1.7378 4.4674 2.3949 2.7960 4.7851 5.6333 5.5098 5.3625 5.0534 5.1607 3.3363 3.3716 2.4970 5.5986 4.4654 4.1090 2.4750 2.2390 2.8672 4.5408 5.0296 4.0975 1.7838 7.0820 4.7031 1.6714 1.7079 3.1987 9.1413 7.8701 2.3263 3.4674 2.2025 5.2394 2.2638 1.2472 1.2404 1.2575 1.7865 1.2370 1.3627 1.6049 2.0434 2.0716 1.4470 1.4377 1.3319 2.8869 2.6262 2.0887 4.0369 3.5102 1.2583 1.2173 1.1308 1.3412 1.1245 1.1145 1.0922 1.0499 1.3951 1.1129 1.5248 1.0744 7.7084 8.5803 6.6591 8.0723 1.0322 1.0359 1.0348 1.0624 1.0652 1.0958 1.1044 1.0949 1.0953 1.0966 1.1056 1.1008 1.1053 1.0902 1.0916 1.0639
irintensity: 0.4454 2.7159 0.9349 2.9430 3.6955 4.3995 1.4722 3.8766 2.4592 8.7176 9.5531 3.2589 1.6855 1.5797 1.9008 1.9075 8.1870 1.5337 2.2649 1.2318 7.2193 2.6931 0.5303 17.0546 30.7509 11.0042 14.2456 64.8837 25.4590 15.3677 14.4673 55.9850 50.5961 25.8228 17.8144 1.0477 8.6705 33.1953 2.6616 11.6737 4.8062 37.0398 4.4755 63.3412 15.3962 58.8856 118.7581 147.3961 234.9484 90.4328 6.4654 17.9243 0.1606 59.2297 1.1617 24.6760 53.1885 49.0525 15.9555 20.5113 41.4977 41.8477 143.4013 493.3760 18.8274 45.6445 125.7921 4.6005 3.3805 20.2854 23.7973 72.8929 16.4835 6.5086 13.8174 53.5443 37.2910 36.8111 14.8548 292.0491 39.5073 3.3144 187.3485 59.6453 70.8554 88.0642 19.0358 37.7796 5.0700 37.1059 7.6452 31.7438 49.1068 18.3808 22.3745 11.7807 7.2987 0.3429 24.1390
temp: 298.150 k
press: 1.00000 atm
elementType: 8 8 8 8 8 8 6 6 6 6 6 6 6 6 6 6 6 6 6 1 1 1 1 1 1 1 1 1 1 1 1 1 1 1 1
symmnumber: 1
zpe: 710407.3 jmol-1
zpe.correction: 0.270580 hartree
zpe.thermalcorrener: 0.291169 hartree
zpe.thermalcorrenthalpy: 0.292114 hartree
zpe.thermalcorrgfe: 0.218819 hartree
zpe.sumelectzpe: -954.844810 hartree
zpe.sumelectthermal: -954.824220 hartree
zpe.sumelectthermalent: -954.823276 hartree
zpe.sumelectthermalfe: -954.896570 hartree
dipole: 3.4046 -0.3406 0.9980
dipole: 3.5642
quadrupole: -91.0711 -106.3374 -113.8158
quadrupole: -3.7290 10.9921 0.3889
quadrupole: 12.6704 -2.5960 -10.0744 -3.7290 10.9921 0.3889
hfenergy: -955.1153896 hartree
pointgroup: C01 [X(C13H16O6)]
dipole: -1.3757511 0.053855 0.2659006 debye
polarizability: 244.3961605|12.8448241|187.6614372|9.2269601|-0.6196305|92.8001459 unknown
InChI: InChI=1S/C13H16O6/c1-17-10-6-8(9(14)4-5-12(15)16)7-11(18-2)13(10)19-3/h6-7,15H,4-5H2,1-3H3
charge 0 multiplicity 1
35 atoms
O  -3.285635 1.725622 -0.56559
O  -1.436167 -2.817499 -0.786019
O  -3.71537 -1.007304 -0.941146
O  1.797422 2.215959 0.068181
O  6.523391 0.371311 0.062839
O  5.15211 -1.183208 1.103685
C  0.232254 0.425987 -0.29984
C  2.799282 0.003102 -0.132235
C  1.613252 0.973158 -0.116582
C  -0.021308 -0.954212 -0.452869
C  -0.85042 1.346348 -0.309232
C  -2.164261 0.883678 -0.486114
C  -1.343914 -1.433053 -0.611794
C  -2.437488 -0.517382 -0.638047
C  4.150215 0.734158 -0.105397
C  5.266752 -0.141968 0.417709
C  -3.042377 3.172568 -0.5204
C  -2.652846 -3.555064 -0.399112
C  -4.825164 -0.679185 -0.016891
H  2.725043 -0.665361 0.749671
H  2.730357 -0.660176 -1.014496
H  0.777298 -1.700247 -0.434527
H  -0.612059 2.406747 -0.191212
H  4.430662 1.126432 -1.097765
H  4.069686 1.627028 0.546575
H  -2.599352 3.474809 0.44742
H  -4.034479 3.632312 -0.638293
H  -2.379366 3.488324 -1.347592
H  -2.989738 -3.262884 0.614039
H  -2.339627 -4.610877 -0.396551
H  -3.465441 -3.387919 -1.122314
H  -4.61424 -1.086065 0.991586
H  -5.707183 -1.17685 -0.447419
H  -4.977416 0.409801 0.035167
H  7.23333 -0.205291 0.457268
