program: Gaussian 09
title: 000290093
version: EM64L-G09RevD.01
frameworkgroup: C1[X(C14H12O6S)]
method: RPBEPBE
basis: SDD
operation: Freq
keyword: #p
keyword: freq=noraman
keyword: PBEPBE/SDD
title: #p freq=noraman PBEPBE/SDD
converged: YES YES NO NO
title: Mulliken charges:
elementType: S O O O O O O C C C C C C C C C C C C C C H H H H H H H H H H H H
charge: 0.911010 -0.321252 -0.249475 -0.497062 -0.531959 -0.444897 -0.258047 0.043631 -0.071435 0.207361 0.252112 -0.317188 -0.255400 -0.216033 -0.329174 -0.192353 -0.204928 -0.221666 -0.211264 0.150300 -0.529789 0.286127 0.294038 0.331436 0.264308 0.240888 0.242249 0.242403 0.237104 0.250000 0.287993 0.227247 0.383716
chargesum: 0.00000
title: Mulliken charges with hydrogens summed into heavy atoms:
elementType: S O O O O O O C C C C C C C C C C C C C C
charge: 0.911010 -0.321252 -0.249475 -0.497062 -0.531959 -0.061181 -0.258047 0.043631 -0.071435 0.207361 0.252112 -0.031061 0.038638 0.115404 -0.064866 0.048535 0.037320 0.020737 0.025840 0.150300 0.235450
polarizability: 3.83806316e+02 5.14198766e-01 2.23185674e+02 -1.86587806e+00 -1.71089272e+00 1.18536327e+02
1716.lowfreq: -3.8743 -0.0018 -0.0012 -0.0007 1.9219 6.1843 17.9263 27.6177 42.3409
frequency: 17.4443 27.6035 42.3250 52.7682 67.7120 90.9637 99.4522 113.8280 134.0574 146.2577 168.2996 186.9871 189.0858 218.9509 245.1167 278.5587 283.3272 306.8632 334.2850 338.7661 379.7148 382.3665 401.3757 404.4818 428.2085 453.6371 487.6546 502.1810 538.8667 569.3797 592.4887 601.2313 607.4490 646.6831 653.5657 684.8175 707.7534 758.8860 765.1792 793.7113 819.2447 832.1232 839.6395 852.7458 904.5732 928.9142 943.3055 966.2953 970.3787 988.3975 990.2025 1004.2158 1006.5599 1042.8587 1044.2160 1079.9557 1081.0929 1113.2263 1156.2223 1168.3126 1173.1136 1187.6811 1194.1573 1241.0189 1266.1641 1311.5555 1315.4707 1353.5957 1381.8430 1398.5005 1430.7552 1435.7212 1446.9878 1454.5965 1464.0409 1482.6878 1548.8116 1571.5543 1580.3090 1596.2714 1640.3618 2969.8558 3091.1551 3135.4598 3136.9255 3148.9616 3151.1122 3156.9201 3166.3936 3174.0489 3174.7275 3192.8913 3533.2946
redmass: 6.1518 5.9583 5.2991 6.4134 7.3689 8.5845 9.5689 4.3212 6.4935 7.8279 6.1772 5.7316 5.7669 5.0402 8.2046 1.2840 3.0965 6.3119 7.1971 8.3524 8.2293 8.6745 5.9481 3.4382 7.5711 6.4517 4.2476 3.1954 3.3302 5.0636 1.5575 6.4702 4.3343 6.1040 6.1746 2.6759 7.0854 1.3450 2.1954 14.5121 2.3120 6.3157 7.4307 1.2402 18.8082 1.3916 1.3450 8.0378 5.6962 1.3668 1.4038 2.6218 1.7516 1.9966 2.9416 1.9166 1.6355 1.2441 1.4275 1.1850 1.0606 1.1293 1.8352 4.5363 2.7821 2.6190 1.2958 4.8324 8.6009 4.2146 1.6201 2.2269 1.1868 1.9301 1.3971 1.0719 6.3834 5.6349 5.7906 6.7564 8.6368 1.0364 1.0965 1.1059 1.0860 1.0892 1.0877 1.0939 1.0966 1.0952 1.1011 1.0958 1.0642
irintensity: 0.6542 1.8186 0.6104 4.1600 0.1164 1.2899 2.0681 5.2446 1.0620 3.6599 4.3739 8.2512 6.6691 28.4678 6.6095 0.9551 12.6267 9.9857 15.7924 1.7156 7.5132 6.2884 35.7767 9.1862 30.5714 16.6439 72.7908 12.8162 19.0852 35.0862 87.5241 1.1097 21.7710 24.4035 22.5721 22.0468 25.0420 81.9707 18.2473 97.7032 28.3342 13.2352 16.2779 0.1071 55.5012 1.6329 1.4623 150.8082 12.0060 2.0286 0.5610 1.5634 0.9457 23.1850 158.3472 18.4088 19.2425 1.1448 11.6592 42.9728 2.7953 28.1433 51.7985 103.0380 73.4895 121.6349 9.2611 34.2597 7.0546 86.2951 31.4594 22.7267 32.9755 27.5187 3.0191 29.7136 71.2488 6.1563 61.7343 4.9578 152.7094 20.3047 18.2578 28.8753 3.7838 31.6457 6.1327 5.5912 6.4378 16.7816 51.3614 4.3303 46.9788
temp: 298.150 k
press: 1.00000 atm
elementType: 16 8 8 8 8 8 8 6 6 6 6 6 6 6 6 6 6 6 6 6 6 1 1 1 1 1 1 1 1 1 1 1 1
symmnumber: 1
zpe: 609746.8 jmol-1
zpe.correction: 0.232240 hartree
zpe.thermalcorrener: 0.252600 hartree
zpe.thermalcorrenthalpy: 0.253544 hartree
zpe.thermalcorrgfe: 0.181383 hartree
zpe.sumelectzpe: -1388.402622 hartree
zpe.sumelectthermal: -1388.382262 hartree
zpe.sumelectthermalent: -1388.381318 hartree
zpe.sumelectthermalfe: -1388.453479 hartree
dipole: -0.9512 0.9032 -2.7483
dipole: 3.0453
quadrupole: -93.9357 -114.8162 -139.5487
quadrupole: 1.0521 5.2706 2.4220
quadrupole: 22.1645 1.2840 -23.4485 1.0521 5.2706 2.4220
hfenergy: -1388.6348619 hartree
pointgroup: C01 [X(C14H12O6S1)]
dipole: 0.3717536 0.2837055 1.1030626 debye
polarizability: 383.7395491|2.9532009|222.4419313|-2.8660972|9.2018171|119.3468377 unknown
InChI: InChI=1S/C8H7O4.C6H5O2S/c1-12-6-4-2-3-5(7(6)9)8(10)11;7-9(8)6-4-2-1-3-5-6/h2-4,10H,1H3;1-5H
charge 0 multiplicity 1
33 atoms
S  0.88928 -0.635406 -0.963333
O  -0.436255 -0.653163 0.795153
O  -2.345622 -2.870757 0.533264
O  0.324538 0.540777 -1.946211
O  1.028811 -2.158072 -1.562628
O  -2.039293 3.28438 -0.02948
O  -0.195983 2.183983 0.815023
C  -1.725696 -0.421003 0.491085
C  2.55967 -0.187228 -0.203738
C  -2.254505 0.919375 0.285593
C  -2.654142 -1.538576 0.377394
C  -3.624631 1.107937 0.017208
C  3.595532 -1.126501 -0.351952
C  2.685859 1.039996 0.467359
C  -4.031593 -1.3044 0.122376
C  -4.507888 0.000988 -0.05857
C  4.856021 -0.791159 0.193171
C  3.957882 1.347922 1.005246
C  5.035014 0.440683 0.866415
C  -1.373901 2.115973 0.392076
C  -0.972126 -3.404281 0.683958
H  -3.996433 2.123668 -0.131683
H  3.42144 -2.069759 -0.878716
H  1.827679 1.708025 0.589166
H  -4.691337 -2.174529 0.056497
H  -5.569333 0.166974 -0.267991
H  5.691569 -1.491099 0.088845
H  4.098191 2.293123 1.539698
H  6.014551 0.690702 1.288278
H  -0.476289 -2.958936 1.560475
H  -0.371438 -3.202805 -0.223232
H  -1.132195 -4.484752 0.817386
H  -1.407179 4.047214 0.056062
