program: Gaussian 09
title: 000290092
version: EM64L-G09RevD.01
frameworkgroup: C1[X(C19H26O9)]
method: RPBEPBE
basis: SDD
operation: Freq
keyword: #pfreq=noraman
keyword: PBEPBE/SDD
title: #p freq=noraman PBEPBE/SDD
converged: YES YES NO NO
title: Mulliken charges:
elementType: O O O O O O O O O C C C C C C C C C C C C C C C C C C C H H H H H H H H H H H H H H H H H H H H H H H H H H
charge: -0.276658 -0.257036 -0.262708 -0.228167 -0.224226 -0.216218 -0.243709 -0.277909 -0.265037 -0.153523 -0.451390 -0.324014 -0.595667 0.588969 0.211991 0.210228 0.241340 -0.595258 -0.596459 0.244548 0.272709 0.037606 -0.503022 -0.501969 -0.500080 -0.537578 -0.535399 -0.519577 0.270447 0.240396 0.258147 0.316241 0.229678 0.205867 0.249570 0.259746 0.234344 0.243394 0.242950 0.248576 0.242571 0.237953 0.247317 0.245808 0.234940 0.221077 0.217651 0.242514 0.240896 0.220537 0.224649 0.244928 0.211734 0.226280
chargesum: 0.00000
title: Mulliken charges with hydrogens summed into heavy atoms:
elementType: O O O O O O O O O C C C C C C C C C C C C C C C C C C C
charge: -0.276658 -0.257036 -0.262708 -0.228167 -0.224226 -0.216218 -0.243709 -0.277909 -0.265037 0.116925 0.047153 -0.007773 -0.160122 0.588969 0.211991 0.210228 0.241340 -0.345688 -0.336714 0.244548 0.272709 0.037606 0.217667 0.227131 0.227985 0.143664 0.150683 0.163365
polarizability: 2.67091482e+02 1.25280435e+01 2.67911991e+02 2.19836378e+01 -1.27774937e+01 1.87621283e+02
1716.lowfreq: -6.0357 -2.7261 0.0005 0.0007 0.0011 2.7477 5.2676 12.6481 22.1174
frequency: -2.1830 12.2475 22.0820 27.9819 37.2543 47.4280 50.4449 56.4414 59.0010 69.5607 74.6302 84.6797 88.6000 96.7271 100.2225 101.4465 109.9757 121.6958 153.6651 155.5793 161.7204 167.5897 185.3479 191.5981 196.4935 200.7791 207.4572 213.5018 236.0613 248.4947 256.9424 275.0072 277.9604 284.6056 298.1498 321.1592 332.4517 350.4138 366.5781 368.0765 413.3477 458.6608 479.6260 498.4726 512.7840 557.7282 584.3188 587.1436 618.1471 628.0429 661.9942 667.7555 684.3940 728.0915 732.1778 759.7772 760.1304 772.5658 818.3356 834.0616 840.8435 859.5284 867.3053 875.8663 915.0487 941.0539 950.7973 954.1736 993.3826 1006.4594 1022.0792 1033.8587 1039.5802 1086.3391 1102.4164 1107.9669 1109.8803 1112.2943 1113.9628 1114.3468 1114.4237 1120.7651 1128.5784 1140.9149 1149.7274 1150.4554 1151.4287 1154.8060 1156.1210 1159.2946 1159.8232 1186.1728 1212.1876 1218.1950 1229.7952 1261.5166 1284.1628 1295.3228 1316.2019 1332.1001 1335.3922 1354.9510 1383.0939 1413.6489 1421.4817 1421.6742 1422.1950 1422.3516 1442.3162 1447.5618 1452.6831 1453.0030 1453.6632 1454.3174 1456.9134 1462.1907 1462.3604 1464.5001 1464.8860 1466.0684 1469.5706 1473.8869 1478.6535 1479.2079 1491.1706 1593.3361 1598.0335 1642.0121 1646.7398 1650.2051 2955.2937 2959.5572 2969.1014 2982.1300 3001.2187 3005.7767 3008.4123 3009.6564 3016.9609 3036.2883 3039.5026 3041.7781 3047.5098 3068.4097 3082.5863 3108.6542 3112.9196 3114.2758 3116.2962 3120.7200 3121.0573 3147.8006 3150.3478 3152.3256 3155.3380 3155.5218
redmass: 4.6473 4.8715 5.0544 5.2543 4.8025 5.1312 4.2935 3.8224 3.7164 2.6176 2.9547 2.2384 1.6181 1.5095 1.9343 3.4673 1.2207 4.1224 3.2049 1.4120 3.5217 3.5938 3.1005 2.0921 2.7402 3.0427 3.4911 2.9615 3.4739 1.6183 4.6560 5.0836 1.8681 2.7816 4.6734 4.6530 5.3793 4.3636 5.2956 3.5844 5.9094 5.9009 4.7618 5.7413 6.8478 7.5632 4.6641 4.6689 4.3439 3.8057 4.8158 4.0022 4.6052 5.3789 5.8697 3.1599 1.8198 5.7678 3.2063 1.6261 1.8946 4.0101 5.8945 5.1869 8.2072 5.4238 6.5856 9.0406 4.5009 4.8960 3.3361 2.0800 4.2845 5.5087 2.9800 1.2805 1.2614 1.2623 1.3457 1.2703 1.2767 2.3612 2.6230 2.4576 1.4494 1.4537 1.4495 1.5315 1.5062 1.4846 2.0771 2.1901 1.9343 1.4570 1.6184 1.4069 1.3867 1.2983 4.1331 1.7153 1.4624 1.4498 7.5347 1.8042 1.2100 1.1839 1.1818 1.1809 1.2075 1.4807 1.0606 1.0807 1.0499 1.0498 1.0853 1.0502 1.0511 1.0508 1.0521 1.0520 1.2045 1.0819 1.0563 1.1037 2.3971 7.7159 6.1768 9.9753 9.3935 9.5869 1.0331 1.0328 1.0318 1.0602 1.0791 1.0302 1.0294 1.0293 1.0620 1.0817 1.1002 1.1036 1.1038 1.1019 1.1034 1.1047 1.1049 1.1049 1.1026 1.0992 1.0996 1.0904 1.1049 1.0913 1.1051 1.1050
irintensity: 0.0564 0.1076 0.2130 0.5535 0.2202 1.9421 2.4293 1.9229 7.4393 5.9071 0.7997 2.2797 0.6943 1.4902 1.6703 0.3952 0.1795 2.5462 5.7914 0.9110 0.9460 9.3501 1.0159 0.5767 0.7095 3.9061 1.7448 4.3951 5.3005 2.4465 7.9729 9.0856 0.8387 6.3930 16.6721 14.3270 6.2845 0.4577 2.4889 20.5719 0.6985 15.8522 5.5096 3.2046 4.8898 5.0954 6.9089 2.7087 6.2566 3.0307 2.8124 12.6628 5.2014 6.5434 9.2671 17.7665 14.3636 4.1809 5.5090 13.5885 23.3641 6.5113 4.0845 5.0290 9.8866 16.1159 30.0333 25.6398 52.0777 9.9813 2.7853 34.3086 26.0870 221.6473 69.0083 12.5955 0.1948 0.7928 24.3328 1.3944 0.5537 187.7624 297.3055 35.3518 7.9225 12.9659 7.2649 19.6149 65.4764 1.6448 192.2013 126.6584 78.5697 53.5338 81.5429 64.1974 40.1695 30.0299 50.7927 24.6991 34.1143 5.1303 0.2855 92.9123 7.9714 10.2899 28.7063 16.4213 3.4290 54.0188 9.7827 1.4528 21.9927 15.0167 1.5572 17.4385 8.5014 10.7626 12.8741 14.5798 61.5597 54.8471 11.5364 7.3330 64.2247 137.9464 32.0607 122.2106 180.2624 183.8081 68.8400 59.9735 82.0000 25.2066 6.5782 33.1459 31.9818 26.1881 20.7858 5.3593 7.7267 49.0975 46.4907 36.4433 12.9435 24.1014 21.7219 21.8546 27.8081 28.6600 28.9382 9.0164 16.0432 3.9279 13.2267 14.1396
temp: 298.150 k
press: 1.00000 atm
elementType: 8 8 8 8 8 8 8 8 8 6 6 6 6 6 6 6 6 6 6 6 6 6 6 6 6 6 6 6 1 1 1 1 1 1 1 1 1 1 1 1 1 1 1 1 1 1 1 1 1 1 1 1 1 1
symmnumber: 1
zpe: 1119670.5 jmol-1
zpe.correction: 0.426460 hartree
zpe.thermalcorrener: 0.458150 hartree
zpe.thermalcorrenthalpy: 0.459095 hartree
zpe.thermalcorrgfe: 0.359656 hartree
zpe.sumelectzpe: -1414.421605 hartree
zpe.sumelectthermal: -1414.389915 hartree
zpe.sumelectthermalent: -1414.388970 hartree
zpe.sumelectthermalfe: -1414.488409 hartree
dipole: -6.6842 0.2909 0.3726
dipole: 6.7009
quadrupole: -166.4444 -134.2044 -157.0861
quadrupole: 9.9139 2.8855 -2.7174
quadrupole: -13.8661 18.3739 -4.5078 9.9139 2.8855 -2.7174
hfenergy: -1414.848065 hartree
pointgroup: C01 [X(C19H26O9)]
dipole: 2.6340929 -0.043818 0.0992401 debye
polarizability: 265.5979484|11.0302838|269.8024257|-24.6200683|6.293467|187.224382 unknown
InChI: InChI=1S/C19H26O9/c1-23-13-9-11(10-14(24-2)16(13)25-3)7-8-12(17(20)26-4)15(18(21)27-5)19(22)28-6/h9-10,12,15H,7-8H2,1-6H3
charge 0 multiplicity 1
54 atoms
O  3.72311 1.753827 -2.048303
O  4.282134 -2.438001 0.636609
O  3.814467 1.312493 1.47302
O  1.846636 2.684481 -1.036585
O  2.515934 -2.637312 -0.865803
O  2.499607 -0.450534 2.247299
O  -4.370938 2.341499 0.59436
O  -4.453224 -2.346746 -0.323804
O  -5.679416 -0.023371 0.590738
C  2.179207 0.212909 -1.03442
C  0.745389 0.069315 -0.476855
C  3.291047 -0.397622 -0.11174
C  -0.331575 0.267569 -1.578113
C  -1.744376 0.177497 -1.019421
C  2.519846 1.67571 -1.341488
C  3.274895 -1.927484 -0.170855
C  3.147875 0.095509 1.33099
C  -2.410458 -1.067954 -0.959831
C  -2.379695 1.334581 -0.513313
C  -3.674372 1.249611 0.056945
C  -3.708686 -1.154751 -0.402332
C  -4.358101 0.00132 0.115948
C  4.194985 3.122242 -2.37027
C  4.369286 -3.917986 0.709318
C  3.669081 1.971949 2.796138
C  -3.728645 3.653227 0.500579
C  -3.86278 -3.547109 -0.917804
C  -5.907649 -0.813703 1.817043
H  2.253302 -0.345715 -1.988885
H  0.579331 0.809492 0.326904
H  0.626796 -0.934019 -0.032183
H  4.275176 -0.060866 -0.48584
H  -0.180296 1.255879 -2.051602
H  -0.182448 -0.503551 -2.359733
H  -1.911206 -1.957968 -1.35544
H  -1.851397 2.291691 -0.561961
H  5.140347 2.973962 -2.910321
H  4.351208 3.69549 -1.441158
H  3.453562 3.642628 -2.999308
H  3.432444 -4.327707 1.121459
H  4.545027 -4.338834 -0.294741
H  5.217154 -4.114591 1.379312
H  2.60719 2.195039 2.991382
H  4.058096 1.313839 3.590538
H  4.260197 2.894247 2.715143
H  -3.539584 3.936576 -0.553342
H  -2.775792 3.682457 1.065343
H  -4.447566 4.354126 0.950196
H  -4.616779 -4.336245 -0.779221
H  -2.923494 -3.833668 -0.405541
H  -3.665983 -3.404209 -1.997966
H  -5.682059 -1.880625 1.643574
H  -5.292151 -0.422409 2.650228
H  -6.975858 -0.681588 2.048617
