program: Gaussian 09
title: 000290091
version: EM64L-G09RevD.01
frameworkgroup: C1[X(C10H10O4)]
method: RPBEPBE
basis: SDD
operation: Freq
keyword: #pfreq=noraman
keyword: PBEPBE/SDD
title: #p freq=noraman PBEPBE/SDD
converged: YES YES NO NO
title: Mulliken charges:
elementType: O O O O C C C C C C C C C C H H H H H H H H H H
charge: -0.273940 -0.131497 -0.411758 -0.179588 0.542179 -0.644812 -0.572147 -0.367937 0.348733 -0.223288 -0.379494 0.150733 0.109811 -0.537156 0.270743 0.264923 0.253255 0.235826 0.223404 0.243363 0.244562 0.222668 0.220261 0.391155
chargesum: 0.00000
title: Mulliken charges with hydrogens summed into heavy atoms:
elementType: O O O O C C C C C C C C C C
charge: -0.273940 -0.131497 -0.020603 -0.179588 0.542179 -0.109145 -0.318892 -0.132111 0.348733 0.000116 -0.136131 0.150733 0.109811 0.150335
polarizability: 1.69036264e+02 -8.69630709e-01 1.15232057e+02 7.03587663e+00 2.86293824e+00 7.44232188e+01
1716.lowfreq: -5.4936 -0.0003 0.0008 0.0009 4.3664 7.4113 17.3265 26.4052 30.0323
frequency: 16.7631 26.3527 29.9670 73.8040 99.2783 188.3980 199.8715 210.5641 239.5391 261.1698 301.5492 341.0103 357.7521 437.9804 445.9278 450.1067 540.3411 553.7902 577.4953 605.8951 640.1985 674.0988 694.2094 722.2717 769.7992 812.5973 874.7252 880.0044 884.7734 928.3246 965.4877 982.8898 1013.6435 1020.1275 1041.9806 1095.3619 1111.9599 1146.9946 1161.3929 1172.7868 1188.9902 1254.8032 1269.5309 1300.3255 1324.9172 1390.6402 1415.1761 1432.8666 1451.9260 1466.1357 1475.2359 1480.7647 1592.2644 1625.0129 1641.6381 1663.0360 2958.8668 2967.9699 3034.4074 3046.1739 3124.5753 3132.3760 3146.2033 3154.2895 3168.9411 3499.0623
redmass: 8.4192 11.1763 4.3137 4.1283 4.0936 4.9327 1.7507 3.1153 5.1139 1.7762 2.7652 11.1706 3.2707 3.6576 5.9033 3.9796 4.4868 4.2810 5.4708 1.5703 4.6610 2.4112 2.0927 5.7731 1.8122 2.6266 1.7610 3.0933 1.6768 2.6674 1.3430 5.8395 5.6737 3.7507 2.4364 1.6795 1.2600 1.4718 1.2863 1.2827 1.1793 3.0170 1.9351 1.4641 1.8010 7.9463 1.1402 1.2492 2.2015 1.0509 1.1136 2.5244 6.1168 6.7092 10.0962 10.2508 1.0330 1.0670 1.0900 1.1039 1.0992 1.0864 1.0919 1.0929 1.0977 1.0643
irintensity: 2.0123 1.1155 0.2639 7.6810 3.4122 0.7300 0.8178 5.0989 2.2425 0.9088 0.3869 2.0818 2.1968 0.9636 11.3472 14.8913 2.7297 6.1312 26.0639 87.8756 22.8735 85.6890 19.3850 12.3528 49.2618 8.2813 1.6381 8.9745 16.4723 13.2747 0.5576 0.2057 32.5358 203.7252 146.0843 9.0423 0.2203 17.1258 18.4771 34.2785 2.2995 153.5682 3.5340 7.8811 39.3336 8.0166 32.6536 22.7117 38.2274 13.1927 13.6663 50.2143 55.5618 82.6307 173.6777 71.7708 67.8977 19.7307 3.0875 49.4157 25.6062 6.1051 6.8431 16.0569 12.3772 23.3730
temp: 298.150 k
press: 1.00000 atm
elementType: 8 8 8 8 6 6 6 6 6 6 6 6 6 6 1 1 1 1 1 1 1 1 1 1
symmnumber: 1
zpe: 471073.3 jmol-1
zpe.correction: 0.179422 hartree
zpe.thermalcorrener: 0.193041 hartree
zpe.thermalcorrenthalpy: 0.193985 hartree
zpe.thermalcorrgfe: 0.136132 hartree
zpe.sumelectzpe: -686.906334 hartree
zpe.sumelectthermal: -686.892715 hartree
zpe.sumelectthermalent: -686.891771 hartree
zpe.sumelectthermalfe: -686.949624 hartree
dipole: 2.0999 -1.7372 -2.8104
dipole: 3.9148
quadrupole: -64.0447 -78.0195 -86.0937
quadrupole: 12.9785 13.8771 -3.6050
quadrupole: 12.0079 -1.9668 -10.0411 12.9785 13.8771 -3.6050
hfenergy: -687.0857561 hartree
pointgroup: C01 [X(C10H10O4)]
dipole: -0.7582704 0.320726 -1.3016777 debye
dipolederiv: -1.2859644 0.5466961 0.0238809 0.7741745 -0.774676 -0.0156581 0.0006012 0.0091046 -0.3016346 -0.5719296 -0.0401617 0.0178892 -0.0282394 -0.3081421 0.1832322 -0.116276 0.1513593 -0.620176 -0.4017383 -0.0787803 0.2093647 -0.0624919 -0.5326327 0.3176589 0.1304495 0.2900007 -1.0285701 -0.8894464 0.0518554 -0.3321321 -0.1038207 -0.338496 0.088562 -0.086574 0.1388116 -0.6441319 0.3176876 -0.0366805 -0.0254629 0.0702702 0.1918663 -0.0145418 -0.1274383 -0.0277745 -0.0507944 -0.1629162 0.0079987 -0.1399648 0.0805097 0.0663178 0.1013656 -0.343086 0.1054917 -0.2641465 -0.4176206 0.2727896 -0.044594 0.0186352 -0.058288 -0.0336999 0.0443779 -0.056573 -0.1585644 -0.2015046 -0.1269375 0.0294951 -0.0911416 -0.133696 0.0050323 0.1096363 -0.0286837 -0.154669 0.8169267 -0.5784734 0.0172702 -0.9192571 0.7577452 0.0017505 0.0703806 -0.0337938 0.107527 0.1703508 0.0620377 -0.0627128 -0.0630168 0.141455 -0.0389035 -0.0419999 -0.0686917 -0.1080084 -0.1038818 -0.032819 -0.0182095 0.3145227 -0.3006398 -0.0332393 -0.0781138 0.0200871 -0.2135334 0.9929522 0.0428322 0.1805041 -0.0250447 0.264281 -0.2463895 0.3623683 -0.1972436 0.7776055 0.8404162 0.0440594 0.134273 0.1778218 0.4271788 -0.427202 0.0100447 -0.4482945 1.2783466 0.8552457 -0.2197915 -0.026724 0.0674615 0.2005782 0.016145 -0.0921045 0.0569997 0.3268725 0.0559381 0.0058624 -0.0358523 -0.0774486 -0.037625 0.0323609 0.0184809 0.0073937 0.1262451 -0.0257603 0.0284258 0.0328093 0.0603136 0.0697497 -0.0777571 0.0967609 -0.0430715 0.0546666 0.0897771 -0.0590627 0.0293572 -0.051588 -0.0361251 0.0382865 0.0243442 0.0439959 0.1501297 -0.006108 0.1055569 0.0092031 0.1040733 0.0107713 0.0102279 -0.000218 0.027392 0.1401016 0.0536659 -0.0550968 0.0186049 -0.0556226 -0.097147 0.0488147 0.0263258 0.0542952 0.1383389 -0.1013645 -0.0239821 0.0410115 -0.0274676 0.1020552 0.0159857 0.045204 0.0170015 0.1628939 0.0057312 0.0867423 0.0004131 0.1416694 -0.0833062 0.0172505 -0.0082368 0.0239682 0.1194592 -0.0328361 0.0392173 0.0071442 -0.1039286 0.0800606 0.1043581 0.0902066 0.0419204 -0.1356461 -0.0674507 0.0072561 -0.0328816 -0.1675947 0.0097217 -0.1174115 -0.0554106 -0.0993759 -0.0393524 0.0698302 -0.0495442 -0.0326866 -0.0327895 0.378993 0.0237718 -0.0797232 0.0156808 0.3370407 unknown
polarizability: 168.7976409|-6.5052637|109.3749057|-3.9591342|-15.0433588|80.5189934 unknown
InChI: InChI=1S/C10H10O4/c1-14-8-4-2-3-7(5-8)6-9(11)10(12)13/h2-5,12H,6H2,1H3
charge 0 multiplicity 1
24 atoms
O  -3.346117 1.521075 -0.158147
O  1.994675 -0.923056 1.625697
O  3.931383 0.642267 -0.949589
O  4.695561 -0.123878 1.114334
C  -0.163107 -0.345421 -0.275982
C  1.292189 -0.031401 -0.571674
C  -1.123555 0.685561 -0.326288
C  -0.580574 -1.669551 0.026786
C  -2.491697 0.409088 -0.078402
C  -1.941068 -1.938166 0.271057
C  -2.911286 -0.909062 0.221188
C  2.277139 -0.357351 0.548823
C  3.763909 0.048122 0.309363
C  -4.769889 1.29844 0.10185
H  1.430424 1.03336 -0.8392
H  1.647973 -0.581721 -1.469139
H  -0.838542 1.718402 -0.554522
H  0.155941 -2.477365 0.086344
H  -2.259164 -2.95962 0.507631
H  -3.962257 -1.142621 0.415249
H  -5.239287 2.287462 -0.004171
H  -4.937114 0.91425 1.127053
H  -5.209489 0.596292 -0.633438
H  4.886753 0.892295 -1.082323
