program: Gaussian 09
title: 000290090
version: EM64L-G09RevD.01
frameworkgroup: C1[X(C15H18N2O2)]
method: RPBEPBE
basis: SDD
operation: Freq
keyword: #p
keyword: freq=noraman
keyword: PBEPBE/SDD
title: #p freq=noraman PBEPBE/SDD
converged: YES YES NO NO
title: Mulliken charges:
elementType: O O N N C C C C C C C C C C C C C C C H H H H H H H H H H H H H H H H H H
charge: -0.271829 -0.270901 -0.422664 -0.443419 -0.399772 0.463484 0.434884 -0.367056 -0.366783 -0.397635 -0.403042 0.307410 0.311350 -0.358960 -0.354508 -0.330612 -0.330678 -0.537170 -0.537553 0.224524 0.223426 0.300409 0.289741 0.231355 0.261564 0.219704 0.216569 0.233529 0.236868 0.244544 0.246201 0.215169 0.215556 0.240611 0.217146 0.241306 0.217231
chargesum: 0.00000
title: Mulliken charges with hydrogens summed into heavy atoms:
elementType: O O N N C C C C C C C C C C C C C C C
charge: -0.271829 -0.270901 -0.122255 -0.153678 0.048178 0.463484 0.434884 -0.135700 -0.105219 -0.177931 -0.186474 0.307410 0.311350 -0.125431 -0.117640 -0.086067 -0.084477 0.134166 0.138130
polarizability: 2.85880163e+02 -1.09071486e+01 1.67810695e+02 1.30248043e+01 4.09837302e+00 1.31416687e+02
1716.lowfreq: -9.6074 -2.7964 -1.2122 -0.0009 -0.0007 -0.0004 11.9678 27.0924 42.0246
frequency: 11.2365 27.0853 41.9962 70.7463 79.6572 96.3174 108.5336 147.1141 160.4988 182.5327 228.0431 238.9340 242.3826 257.3679 269.8345 291.1299 358.2824 362.6985 367.2625 377.5223 409.0405 413.2871 423.3787 473.6679 500.4858 508.9199 512.3057 520.1486 580.2108 631.7534 636.6744 704.1139 710.7489 712.6152 741.7825 786.7596 798.7742 806.1146 813.5500 816.4952 847.4721 899.0925 916.1620 938.7336 940.3413 986.5947 988.1314 997.9026 998.9862 1043.5942 1079.7775 1107.7282 1112.5158 1113.2574 1122.0609 1132.6749 1157.4491 1158.4043 1179.4058 1181.8819 1219.0006 1221.9244 1252.6832 1266.7697 1289.2396 1309.8701 1313.0112 1359.4012 1372.1924 1388.9088 1417.4677 1422.7667 1435.9820 1437.4930 1458.6003 1463.4431 1465.5148 1473.2403 1475.2023 1484.0602 1495.9588 1508.4198 1522.1172 1582.9999 1592.2636 1637.8159 1641.9776 2906.8100 2944.4919 2947.1139 2950.0346 3029.4437 3033.5765 3115.3858 3116.7143 3118.6004 3120.2030 3138.9729 3145.1231 3159.9596 3162.9634 3164.0414 3166.7514 3573.2683 3590.0039
redmass: 5.3311 3.9851 3.4104 4.2639 3.4859 3.9927 4.5908 4.2043 4.3011 3.4578 1.8655 2.8137 1.2183 1.7495 2.7030 1.1566 4.2769 5.5269 2.3137 2.4373 3.4602 3.0142 2.1617 4.0404 3.9098 4.0173 2.2443 2.4308 4.6722 6.9277 6.5788 4.3275 3.4371 3.5428 5.3792 1.3608 1.3919 3.4818 1.6494 1.7254 5.0376 1.3825 1.3694 1.3444 1.3431 4.7896 5.4148 3.4283 3.4934 1.9697 2.9149 1.8597 1.2614 1.2614 1.4900 1.8333 1.3315 1.3256 1.2801 1.2598 2.4189 2.6308 1.1453 1.7937 1.8897 1.4232 1.5933 2.9091 3.7277 1.6536 2.9545 3.3430 1.1694 1.1811 1.7962 1.0508 1.0501 1.1428 1.1017 1.5476 1.1987 2.5502 2.6696 6.2886 5.5026 6.5222 6.5416 1.0571 1.1041 1.0338 1.0334 1.1034 1.1035 1.0894 1.0984 1.0986 1.0890 1.0867 1.0871 1.0949 1.0947 1.0955 1.0957 1.0774 1.0775
irintensity: 0.0296 0.3512 1.0037 5.5956 4.6900 2.9818 1.5116 1.5296 7.7578 3.0798 11.5436 6.0800 0.3318 9.8848 20.7912 78.5845 21.6107 1.3260 74.3805 33.6198 2.6382 0.6645 24.0982 1.6642 13.5770 3.0136 24.2368 22.6697 2.6729 0.6835 1.1484 41.9842 0.3553 0.8967 31.6355 14.9451 4.1704 1.2169 82.2593 84.8670 1.6434 0.4049 0.0769 0.1560 0.1419 21.0173 20.8984 32.1071 43.7401 1.8906 49.4038 24.0838 0.2188 0.2310 46.9860 45.7462 1.4641 2.4025 34.3704 31.7490 354.1511 156.4306 43.1029 19.7895 32.6109 35.8369 6.5259 33.9098 73.0978 56.9465 95.6021 34.2448 17.9436 18.3989 113.3000 11.6513 12.5814 39.9845 132.4829 11.5549 40.0847 632.9736 153.0138 1.5549 0.0857 40.8478 9.5914 71.8440 50.5233 82.9393 72.7150 58.7088 55.8768 22.9567 34.4310 30.3875 17.8838 27.9008 13.4102 22.6698 16.2280 0.8961 1.1870 41.5991 26.5285
temp: 298.150 k
press: 1.00000 atm
elementType: 8 8 7 7 6 6 6 6 6 6 6 6 6 6 6 6 6 6 6 1 1 1 1 1 1 1 1 1 1 1 1 1 1 1 1 1 1
symmnumber: 1
zpe: 790815.0 jmol-1
zpe.correction: 0.301206 hartree
zpe.thermalcorrener: 0.319968 hartree
zpe.thermalcorrenthalpy: 0.320912 hartree
zpe.thermalcorrgfe: 0.252121 hartree
zpe.sumelectzpe: -840.910171 hartree
zpe.sumelectthermal: -840.891409 hartree
zpe.sumelectthermalent: -840.890465 hartree
zpe.sumelectthermalfe: -840.959256 hartree
dipole: -0.2208 -0.9039 -1.5385
dipole: 1.7979
quadrupole: -118.7961 -97.4068 -109.3431
quadrupole: 3.8656 11.1473 -1.4010
quadrupole: -10.2808 11.1085 -0.8277 3.8656 11.1473 -1.4010
hfenergy: -841.2113768 hartree
pointgroup: C01 [X(C15H18N2O2)]
dipole: 0.1034271 0.045126 0.6983037 debye
polarizability: 283.1983284|24.8790089|155.7804837|2.2581696|-18.6878423|146.1287327 unknown
InChI: InChI=1S/C15H18N2O2/c1-18-14-7-3-12(4-8-14)16-11-17-13-5-9-15(19-2)10-6-13/h3-10,16-17H,11H2,1-2H3
charge 0 multiplicity 1
37 atoms
O  5.784104 1.368009 -1.037914
O  -5.928812 0.832836 -0.617213
N  0.784866 -1.055791 0.078633
N  -1.209749 -1.6704 1.283938
C  0.096394 -1.050995 1.3795
C  2.026268 -0.447116 -0.145523
C  -2.354906 -1.007197 0.788615
C  2.712657 0.27022 0.873776
C  -2.270203 0.241677 0.119282
C  2.637635 -0.528843 -1.435382
C  -3.639676 -1.602466 0.955169
C  4.546538 0.797388 -0.666158
C  -4.70382 0.285656 -0.180679
C  3.958874 0.890659 0.615264
C  -3.435786 0.887248 -0.355983
C  3.875331 0.079746 -1.68924
C  -4.796353 -0.967385 0.47516
C  6.503603 2.112813 -0.008043
C  -5.873051 2.125371 -1.29697
H  0.003823 0.001124 1.73164
H  0.68817 -1.598538 2.146551
H  0.392747 -1.676694 -0.629004
H  -1.352244 -2.557764 1.761759
H  2.288183 0.349448 1.879692
H  -1.293815 0.703095 -0.057901
H  2.128303 -1.073448 -2.240293
H  -3.729923 -2.567752 1.469775
H  4.45365 1.434791 1.426033
H  -3.332156 1.848905 -0.868116
H  4.34276 0.015047 -2.676914
H  -5.783884 -1.421572 0.602788
H  6.76232 1.466773 0.855087
H  5.916728 2.982931 0.34936
H  7.425781 2.464899 -0.494306
H  -5.453512 2.912436 -0.638816
H  -6.917336 2.368628 -1.543729
H  -5.274712 2.068857 -2.228339
