program: Gaussian 09
title: 000290088
version: EM64L-G09RevD.01
frameworkgroup: C1[X(C17H20O2)]
method: RPBEPBE
basis: SDD
operation: Freq
keyword: #pfreq=noraman
keyword: PBEPBE/SDD
title: #p freq=noraman PBEPBE/SDD
converged: YES YES NO NO
title: Mulliken charges:
elementType: O O C C C C C C C C C C C C C C C C C H H H H H H H H H H H H H H H H H H H H
charge: -0.241442 -0.258853 0.243127 -0.509553 -0.514136 0.403558 -0.165324 -0.587846 -0.784725 0.105990 0.347201 -0.541059 0.147921 -0.738145 -0.352564 -0.542103 0.321616 -0.395917 -0.535196 0.206913 0.212436 0.226574 0.218701 0.230720 0.231008 0.237662 0.237023 0.227636 0.220501 0.239139 0.252952 0.212426 0.208538 0.233575 0.259220 0.245344 0.225274 0.247877 0.223927
chargesum: 0.00000
title: Mulliken charges with hydrogens summed into heavy atoms:
elementType: O O C C C C C C C C C C C C C C C C C
charge: -0.241442 -0.258853 0.243127 -0.090204 -0.068861 0.403558 0.065396 -0.119176 -0.099564 0.105990 0.347201 -0.301919 0.147921 -0.064229 -0.118988 -0.282882 0.321616 -0.150573 0.161882
polarizability: 3.20092792e+02 -1.50703615e+01 1.89803967e+02 -1.42813939e+00 -1.74468637e+00 1.13196459e+02
1716.lowfreq: -7.8699 -5.7663 0.0002 0.0008 0.0009 5.9332 27.2520 55.3759 86.4706
frequency: 27.1374 55.3640 86.4625 110.5526 122.2779 139.9258 166.9628 177.5902 205.4362 211.0274 228.2025 244.8849 256.8180 269.9403 297.5585 312.3605 318.0300 341.5244 367.1633 380.3234 411.1356 442.8179 460.7041 501.3045 530.6913 549.3015 574.0533 611.8438 625.4885 653.5421 663.7916 693.3685 710.5352 748.6689 759.5525 814.5376 825.8883 864.6275 876.3467 893.4754 896.7306 904.0584 929.3986 941.6223 949.8733 963.4698 990.5148 1001.9724 1034.2880 1037.0715 1074.9479 1102.0883 1111.7260 1117.2278 1140.4540 1146.2080 1165.1942 1181.4587 1183.9797 1193.0178 1228.1601 1231.3952 1236.3233 1254.8085 1256.8410 1272.2108 1286.6864 1313.5847 1330.5752 1337.1760 1344.9416 1359.9772 1379.9459 1384.2247 1389.2614 1434.7904 1440.9203 1451.1909 1453.6800 1464.7838 1467.9169 1468.4366 1471.3228 1473.0097 1479.4235 1487.9870 1491.3478 1555.0968 1567.0928 1588.0458 1626.1719 2946.4163 2963.1207 2965.3756 2970.2425 2975.8026 2978.4617 2983.8186 3021.9221 3025.9662 3039.2865 3055.7291 3072.8874 3074.1900 3081.1554 3101.5127 3129.4321 3133.4485 3143.7019 3147.9238 3169.3308
redmass: 3.8139 4.8260 3.2976 3.4070 3.8762 3.4385 1.6780 1.2410 2.4900 1.5611 1.3425 2.7084 4.6523 1.7103 3.1163 3.0571 3.3527 2.9835 3.2709 3.5502 3.9402 2.7938 3.9956 4.1241 3.8996 4.0676 3.5995 4.3298 4.3538 4.0564 2.8145 2.7975 5.6480 3.2905 2.9213 1.5318 2.8458 1.8741 2.8700 1.5691 1.7064 1.7666 2.2830 1.7815 1.4067 2.0044 1.6346 4.4837 1.7425 1.8230 2.0957 2.1645 1.2594 2.1219 1.7166 1.4358 1.8915 1.4684 1.9801 1.6761 1.7105 1.8480 2.5796 2.6344 1.8976 1.4295 1.4651 1.7564 1.8211 1.4763 1.8033 1.6369 3.5377 1.2855 1.3654 1.4727 2.3838 1.0932 1.1112 1.0622 1.0504 1.0692 1.0772 1.0873 1.0691 1.4361 1.5259 8.3415 7.2069 6.6338 6.9765 1.0794 1.0606 1.0327 1.0633 1.0524 1.0450 1.0365 1.1012 1.0954 1.1025 1.1042 1.0989 1.0998 1.0993 1.0986 1.0998 1.0901 1.0915 1.0866 1.0956
irintensity: 2.3282 0.4626 6.6905 2.5439 1.1447 0.6415 0.0355 0.1592 0.9152 0.4888 0.1190 3.3296 3.6909 0.9482 4.4967 1.7312 2.9062 6.9549 6.1931 5.5312 0.6786 6.9547 1.1323 0.0362 4.7165 7.7440 8.5787 13.3701 2.1520 0.4640 1.4979 1.0179 2.4916 0.1328 9.2348 41.5031 0.3538 5.5816 2.3545 26.8583 6.0724 19.4597 0.1564 1.1295 0.8174 4.4300 3.2552 69.1395 3.3224 0.7489 16.6964 16.1924 0.1639 49.9790 9.0630 12.8344 3.9850 49.0842 5.5761 47.8697 22.1622 58.0320 253.7916 32.1926 136.1458 7.9007 8.8553 55.1569 15.1730 0.2757 9.4990 8.3348 10.1595 43.7348 34.0894 12.0605 0.5449 7.1817 13.9997 8.4867 14.0934 17.6430 8.4718 62.5793 12.3648 9.7634 57.7952 185.7695 18.5861 434.2592 109.6801 5.3779 27.2502 79.1344 14.6810 42.6185 31.5152 53.2827 18.4035 33.3023 49.8811 44.2537 30.2616 41.7540 26.1511 14.0077 26.9819 11.8648 8.7067 1.4092 16.0227
temp: 298.150 k
press: 1.00000 atm
elementType: 8 8 6 6 6 6 6 6 6 6 6 6 6 6 6 6 6 6 6 1 1 1 1 1 1 1 1 1 1 1 1 1 1 1 1 1 1 1 1
symmnumber: 1
zpe: 855949.4 jmol-1
zpe.correction: 0.326014 hartree
zpe.thermalcorrener: 0.343704 hartree
zpe.thermalcorrenthalpy: 0.344648 hartree
zpe.thermalcorrgfe: 0.281199 hartree
zpe.sumelectzpe: -808.854034 hartree
zpe.sumelectthermal: -808.836345 hartree
zpe.sumelectthermalent: -808.835400 hartree
zpe.sumelectthermalfe: -808.898849 hartree
dipole: -4.2136 2.8084 0.6527
dipole: 5.1057
quadrupole: -107.7920 -115.1614 -114.6565
quadrupole: 25.1665 0.8060 -1.7553
quadrupole: 4.7446 -2.6248 -2.1199 25.1665 0.8060 -1.7553
hfenergy: -809.1800484 hartree
pointgroup: C01 [X(C17H20O2)]
dipole: 1.6800418 -1.0719724 0.2516236 debye
polarizability: 320.656524|-12.3852656|189.2168494|1.4195258|2.1912499|113.2198458 unknown
InChI: InChI=1S/C17H20O2/c1-11-10-17(2)7-6-12-8-13(19-3)4-5-14(12)15(17)9-16(11)18/h4-5,8-9,11H,6-7,10H2,1-3H3
charge 0 multiplicity 1
39 atoms
O  -3.5621 2.581433 -0.106211
O  4.958617 0.068199 -0.064532
C  -1.499009 -1.149648 0.17004
C  -2.964269 -1.044127 -0.334767
C  -0.758557 -2.201426 -0.707913
C  -0.778205 0.201178 0.023085
C  -3.753969 0.153482 0.239213
C  0.718069 -2.370781 -0.312232
C  -1.47043 -1.581207 1.668851
C  0.705699 0.188104 0.010841
C  1.436514 -1.036457 -0.160385
C  -1.505792 1.369778 -0.082008
C  -2.972349 1.456658 -0.003867
C  -5.191647 0.234423 -0.312546
C  1.458108 1.386119 0.181144
C  2.844119 -1.017623 -0.18075
C  3.565127 0.187759 -0.023061
C  2.862312 1.406655 0.166363
C  5.753714 1.292862 0.07687
H  -3.496325 -1.986773 -0.096509
H  -2.952864 -0.952893 -1.440905
H  -0.822234 -1.882181 -1.767303
H  -1.286144 -3.172155 -0.627986
H  -3.817514 0.042488 1.344249
H  1.244625 -2.993298 -1.059991
H  0.787443 -2.924871 0.645982
H  -0.4429 -1.598746 2.07195
H  -2.053609 -0.883929 2.295302
H  -1.903917 -2.593037 1.781711
H  -1.014477 2.337899 -0.233898
H  -5.687405 1.153534 0.040807
H  -5.185967 0.262715 -1.418083
H  -5.784564 -0.641727 0.007871
H  0.933915 2.331099 0.352841
H  3.409431 -1.945001 -0.323679
H  3.390906 2.353594 0.307766
H  5.528531 2.012402 -0.733549
H  6.800174 0.963747 0.002184
H  5.581744 1.77195 1.059904
