program: Gaussian 09
title: 000290083
version: EM64L-G09RevD.01
frameworkgroup: C1[X(C16H16O4)]
method: RPBEPBE
basis: SDD
operation: Freq
keyword: #pfreq=noraman
keyword: PBEPBE/SDD
title: #p freq=noraman PBEPBE/SDD
converged: YES YES NO NO
title: Mulliken charges:
elementType: O O O O C C C C C C C C C C C C C C C C H H H H H H H H H H H H H H H H
charge: -0.175737 -0.282613 -0.257806 -0.285108 -0.322117 0.188100 -0.460023 -0.576083 0.173866 0.083586 0.057217 -0.585372 0.357527 -0.369835 -0.562290 0.149422 0.326237 -0.411807 -0.498684 -0.534825 0.267024 0.246202 0.232270 0.226814 0.240274 0.276092 0.265270 0.318508 0.258352 0.246206 0.231395 0.239374 0.239636 0.225698 0.246778 0.226451
chargesum: 0.00000
title: Mulliken charges with hydrogens summed into heavy atoms:
elementType: O O O O C C C C C C C C C C C C C C C C
charge: -0.175737 -0.282613 -0.257806 -0.285108 -0.055094 0.188100 0.018449 -0.108996 0.173866 0.083586 0.057217 -0.044010 0.357527 -0.051326 -0.303938 0.149422 0.326237 -0.165601 0.211721 0.164103
polarizability: 3.08900989e+02 -7.19256574e+00 2.10704793e+02 3.27503437e-01 -1.74671766e+00 9.83990633e+01
1716.lowfreq: -8.2036 -2.4139 -0.0005 -0.0003 0.0004 4.3983 27.2627 39.1026 71.9967
frequency: 27.1934 39.0611 71.9961 81.2847 96.6384 112.1676 113.5962 154.2779 159.9075 177.3058 192.8105 216.9592 226.8138 248.1885 268.1622 299.1587 324.0374 337.3773 358.1953 382.0526 413.6272 448.6934 459.1703 501.1372 519.5643 550.7125 571.2595 593.0628 605.2072 659.0030 679.1787 706.0349 713.8168 735.5969 764.2614 796.0994 833.2166 839.2503 875.8051 884.0383 906.9663 926.1985 949.3055 971.9285 1001.0085 1006.9608 1020.6142 1038.6040 1076.7053 1110.1873 1112.5281 1113.7284 1118.7919 1131.0896 1142.5976 1148.6799 1152.3449 1183.3525 1186.8381 1195.6515 1222.0592 1231.7555 1250.2241 1257.8833 1280.7040 1290.8990 1322.7802 1335.9489 1349.7144 1376.9116 1417.4882 1421.2538 1432.5649 1442.3180 1450.1300 1452.8729 1463.7180 1465.9419 1472.0722 1473.3940 1487.3020 1552.1966 1556.7176 1592.2219 1627.6720 1668.0349 2925.1587 2957.9592 2966.9016 2988.4206 3000.6938 3002.7345 3035.9590 3043.1244 3058.2422 3072.6427 3100.6068 3129.6960 3143.4981 3144.3366 3146.5107 3164.1596
redmass: 4.3746 5.6948 4.4890 3.6079 3.5107 1.3522 2.5508 3.2849 4.6233 3.1654 2.0198 1.9874 2.8084 2.4200 7.1597 5.9775 4.4781 3.5699 4.1668 4.3160 7.8176 2.9768 4.0057 4.1434 3.7959 4.2157 4.0615 4.7135 3.9311 3.5312 4.3879 5.5921 5.7293 4.6109 4.0647 2.3765 1.4636 4.9811 2.9487 2.1187 1.7791 3.1106 3.1082 5.0831 3.6196 1.4389 2.5877 2.3662 2.6998 1.2602 1.2898 1.4325 2.2574 1.8304 1.5376 1.4388 1.5500 2.5990 1.6652 1.7497 1.7971 1.9548 2.8567 1.6037 1.8274 1.8664 1.6743 1.5251 2.1284 5.6316 1.0995 1.1927 1.4276 2.4234 1.0504 1.1309 1.0542 1.0505 1.0855 1.0981 2.3951 7.3880 7.4359 8.2742 6.5439 12.4964 1.0792 1.0664 1.0325 1.0654 1.0296 1.0625 1.0927 1.0938 1.1042 1.1030 1.1041 1.1001 1.1045 1.0914 1.0910 1.0951
irintensity: 1.0354 1.0130 0.5070 6.3525 6.3879 1.7838 0.2448 9.6653 2.3581 3.2564 1.0669 1.1240 1.6965 1.4895 0.2688 17.9002 22.0121 0.7089 1.3296 0.1727 3.5199 4.1336 2.9397 1.1882 2.4527 17.1604 8.7877 2.1217 3.9342 11.1288 2.0660 15.4494 8.8153 5.4502 4.3317 5.1270 38.1932 9.9379 13.4735 9.6169 16.7711 1.3226 10.4540 28.3531 76.4079 8.3103 19.8067 74.5343 111.9798 0.1460 11.8086 42.5716 38.6520 19.2359 159.6180 43.1224 13.6882 422.0564 24.2404 3.2103 24.9580 45.1668 158.0283 39.6376 9.9323 10.3242 2.5764 1.0446 5.5519 19.0903 6.3181 18.9197 22.5981 4.3013 13.3538 11.7448 25.1753 14.4157 44.8142 21.2499 84.1514 66.8594 438.7784 44.7511 233.3703 203.4829 6.2630 21.3954 74.0524 14.0254 49.1180 18.1761 33.4354 2.6203 42.5607 24.9253 27.8035 25.0582 22.9579 1.0585 34.0259 31.3593
temp: 298.150 k
press: 1.00000 atm
elementType: 8 8 8 8 6 6 6 6 6 6 6 6 6 6 6 6 6 6 6 6 1 1 1 1 1 1 1 1 1 1 1 1 1 1 1 1
symmnumber: 1
zpe: 743511.5 jmol-1
zpe.correction: 0.283189 hartree
zpe.thermalcorrener: 0.301501 hartree
zpe.thermalcorrenthalpy: 0.302446 hartree
zpe.thermalcorrgfe: 0.236134 hartree
zpe.sumelectzpe: -918.738123 hartree
zpe.sumelectthermal: -918.719810 hartree
zpe.sumelectthermalent: -918.718866 hartree
zpe.sumelectthermalfe: -918.785177 hartree
dipole: 2.6341 2.5862 -0.2680
dipole: 3.7012
quadrupole: -107.4542 -112.8922 -115.7493
quadrupole: -8.7581 -0.0840 1.1349
quadrupole: 4.5777 -0.8603 -3.7174 -8.7581 -0.0840 1.1349
hfenergy: -919.0213112 hartree
pointgroup: C01 [X(C16H16O4)]
dipole: -1.1175469 -0.9201517 -0.1574284 debye
polarizability: 306.9924908|-15.3766666|212.1804332|0.4647091|7.1588735|98.8319212 unknown
InChI: InChI=1S/C16H16O4/c1-19-10-4-6-11-9(7-10)3-5-12-14(17)8-13(15(11)12)16(18)20-2/h4,6-7,12H,3,5,8H2,1-2H3
charge 0 multiplicity 1
36 atoms
O  3.615451 2.645639 0.084066
O  3.26594 -2.441896 0.068873
O  -4.902598 -0.021333 0.03588
O  1.000095 -2.855177 -0.219257
C  1.324759 1.779394 -0.289853
C  0.807745 0.341404 -0.207508
C  0.589995 2.731572 0.674328
C  -0.893159 2.753616 0.266668
C  -0.655909 0.184526 -0.141087
C  2.840294 1.676431 -0.095039
C  1.892638 -0.53971 -0.170009
C  3.226764 0.202835 -0.151721
C  -1.478565 1.353759 0.082181
C  -1.317967 -1.069565 -0.300778
C  -2.87652 1.220009 0.136831
C  1.932748 -2.009624 -0.113899
C  -3.506663 -0.03522 -0.036805
C  -2.716953 -1.19102 -0.258372
C  3.448063 -3.908186 0.130182
C  -5.6070 -1.299101 -0.121925
H  1.157785 2.165052 -1.322435
H  1.038803 3.738979 0.619778
H  0.703987 2.367293 1.712868
H  -0.99167 3.309144 -0.690195
H  -1.495667 3.308975 1.00883
H  3.863963 -0.07822 0.706693
H  3.845461 0.002561 -1.049513
H  -0.710123 -1.964161 -0.456724
H  -3.510903 2.094015 0.320389
H  -3.17193 -2.176476 -0.393818
H  4.529538 -4.05009 0.267621
H  3.100076 -4.379072 -0.804963
H  2.880591 -4.33258 0.975752
H  -5.417412 -1.739853 -1.119238
H  -6.673516 -1.05148 -0.020736
H  -5.312335 -2.018239 0.665926
