program: Gaussian 09
title: 000290082
version: EM64L-G09RevD.01
frameworkgroup: C1[X(C13H14O3)]
method: RPBEPBE
basis: SDD
operation: Freq
keyword: #pfreq=noraman
keyword: PBEPBE/SDD
title: #p freq=noraman PBEPBE/SDD
converged: YES YES NO NO
title: Mulliken charges:
elementType: O O O C C C C C C C C C C C C C H H H H H H H H H H H H H H
charge: -0.206367 -0.422431 -0.223927 0.205283 -0.490418 -0.600780 0.032408 -0.526164 -0.744696 0.378123 0.123410 -0.404396 -0.355223 0.176114 -0.228409 -0.246525 0.223228 0.223002 0.227123 0.268026 0.258085 0.260484 0.210446 0.247960 0.247492 0.238895 0.282325 0.232161 0.236578 0.378193
chargesum: 0.00000
title: Mulliken charges with hydrogens summed into heavy atoms:
elementType: O O O C C C C C C C C C C C C C
charge: -0.206367 -0.044238 -0.223927 0.205283 -0.044188 -0.105631 0.032408 -0.007596 -0.038798 0.378123 0.123410 -0.165500 -0.072898 0.176114 0.003752 -0.009947
polarizability: 1.89719086e+02 9.65306577e+00 1.51232632e+02 1.28662311e+01 -9.12098244e+00 9.29923451e+01
1716.lowfreq: -9.4424 -0.0003 -0.0002 0.0004 8.5553 16.1085 26.5595 34.5915 84.5626
frequency: 26.5405 33.9617 84.5384 111.2696 121.0357 180.8755 182.8191 199.3081 252.0172 264.3792 295.4601 327.8193 354.0592 399.8034 429.3445 440.8735 453.4595 487.4367 515.5491 527.0825 554.2342 609.9087 637.7906 663.8916 685.6807 718.8649 745.4662 776.5082 792.8792 808.7465 864.8966 889.4718 899.4634 906.6565 931.6616 958.5010 980.5483 1006.4479 1007.5643 1031.9433 1045.3249 1050.3010 1091.8196 1117.2458 1137.7346 1162.2160 1173.2151 1205.0931 1211.9228 1223.9233 1238.3644 1252.0887 1276.8928 1295.3915 1327.0666 1339.3048 1360.2437 1388.1466 1394.9799 1439.9220 1451.7547 1464.7311 1469.9087 1475.4203 1479.0931 1484.8874 1566.6662 1584.6053 1616.3436 1661.7037 2978.7431 2984.1535 2993.9006 3025.8296 3031.7104 3042.8168 3088.2010 3094.5040 3107.3763 3121.4289 3137.6686 3151.1046 3166.6344 3501.8053
redmass: 9.7681 6.0363 4.5382 3.8982 5.8410 3.6296 1.1792 4.1707 3.6381 3.0476 2.4363 3.5906 3.1593 4.1168 3.2081 2.3971 4.0451 3.3470 4.0927 3.3556 4.3120 2.5228 2.0450 2.7719 4.3756 3.9544 1.9367 2.5057 2.5105 3.2908 3.6224 1.6794 1.7657 2.1954 2.1758 2.5436 1.4087 1.5400 1.4846 2.3603 2.1054 1.7831 2.2949 1.7297 1.9140 1.7744 1.0764 1.9299 1.6347 1.8215 1.8016 1.9007 1.4656 1.7028 1.6209 1.6423 1.5943 6.5489 1.2037 2.4228 1.1133 1.1713 1.4351 1.1123 1.1102 1.2892 8.7008 7.0282 6.9053 8.1968 1.0630 1.0605 1.0372 1.0586 1.0962 1.1026 1.0990 1.1036 1.1000 1.0871 1.0893 1.0936 1.1002 1.0638
irintensity: 1.1169 0.8397 0.2468 0.6992 2.5558 0.7476 0.3163 1.1280 0.9118 0.6256 2.0461 5.2422 5.6244 6.1016 1.9165 1.6294 0.0971 11.0762 5.8097 44.0382 9.5520 15.0217 72.9259 46.9083 1.4421 10.3477 50.2322 15.1920 14.4069 7.3790 24.7502 8.5699 6.1209 18.9416 9.9703 31.2170 2.1621 21.8766 9.8902 3.4444 137.8183 4.3352 16.9946 4.4600 64.5265 14.9893 6.5199 3.6665 9.1787 57.6252 50.7806 1.3346 18.7100 61.3241 40.0871 1.9623 3.0229 3.7905 39.5661 22.8960 13.7251 6.3838 13.3489 12.3712 13.2607 15.5552 94.2095 58.9808 38.2619 242.0721 8.7161 20.5265 31.0150 5.2331 29.4780 28.5096 20.2810 12.2561 8.6862 4.8222 12.1731 10.2568 30.2842 22.6966
temp: 298.150 k
press: 1.00000 atm
elementType: 8 8 8 6 6 6 6 6 6 6 6 6 6 6 6 6 1 1 1 1 1 1 1 1 1 1 1 1 1 1
symmnumber: 1
zpe: 631454.5 jmol-1
zpe.correction: 0.240508 hartree
zpe.thermalcorrener: 0.254900 hartree
zpe.thermalcorrenthalpy: 0.255844 hartree
zpe.thermalcorrgfe: 0.198459 hartree
zpe.sumelectzpe: -728.307086 hartree
zpe.sumelectthermal: -728.292694 hartree
zpe.sumelectthermalent: -728.291750 hartree
zpe.sumelectthermalfe: -728.349135 hartree
dipole: -1.8083 -4.0816 0.6846
dipole: 4.5164
quadrupole: -92.2864 -94.7534 -93.0848
quadrupole: -3.8509 1.1887 -0.8435
quadrupole: 1.0884 -1.3785 0.2901 -3.8509 1.1887 -0.8435
hfenergy: -728.5475943 hartree
pointgroup: C01 [X(C13H14O3)]
dipole: 0.7455969 1.6031261 0.1774066 debye
polarizability: 189.7118484|8.3082614|151.6722736|-14.4457621|6.2539375|92.5599413 unknown
InChI: InChI=1S/C13H14O3/c1-13(8-11(14)15)7-6-9-4-2-3-5-10(9)12(13)16/h2-5,14H,6-8H2,1H3
charge 0 multiplicity 1
30 atoms
O  0.177507 -2.546862 -0.253864
O  -2.832255 2.008897 -0.92323
O  -4.20737 0.240425 -0.323115
C  -1.159411 -0.632338 0.495483
C  -0.847815 0.57894 1.417436
C  0.13913 1.584083 0.791395
C  0.165222 -1.319401 0.057209
C  -1.824841 -0.185523 -0.869405
C  -2.066759 -1.649653 1.224909
C  1.406919 0.903373 0.303845
C  1.40408 -0.482504 -0.038758
C  2.614497 1.631984 0.17167
C  2.597122 -1.10305 -0.503793
C  -3.075936 0.642993 -0.672547
C  3.793283 1.01113 -0.292778
C  3.786264 -0.365536 -0.632793
H  -0.420648 0.185663 2.361319
H  -1.792416 1.089221 1.685215
H  0.39664 2.370004 1.526132
H  -0.353951 2.106859 -0.053175
H  -1.110165 0.387236 -1.483044
H  -2.10065 -1.104912 -1.41551
H  -1.62836 -1.922796 2.201954
H  -3.07115 -1.226104 1.394573
H  -2.167439 -2.573205 0.631479
H  2.628268 2.695333 0.43986
H  2.554267 -2.167524 -0.757131
H  4.716911 1.593735 -0.385278
H  4.701129 -0.848828 -0.99161
H  -3.676478 2.519459 -0.78255
