program: Gaussian 09
title: 000290081
version: EM64L-G09RevD.01
frameworkgroup: C1[X(C18H17NO2)]
method: RPBEPBE
basis: SDD
operation: Freq
keyword: #p
keyword: freq=noraman
keyword: PBEPBE/SDD
title: #p freq=noraman PBEPBE/SDD
converged: YES YES NO NO
title: Mulliken charges:
elementType: O O N C C C C C C C C C C C C C C C C C C H H H H H H H H H H H H H H H H H
charge: -0.269762 -0.261169 -0.385824 -0.354769 -0.423422 -0.633972 0.497270 0.339058 0.319192 0.115598 -0.556417 -0.427932 -0.399866 -0.404558 -0.236480 -0.252485 0.235675 0.143296 -0.161437 -0.310407 -0.775272 0.283715 0.232298 0.235260 0.241332 0.228409 0.334845 0.250634 0.244094 0.260835 0.241093 0.234008 0.236211 0.211778 0.246585 0.214744 0.254761 0.253081
chargesum: 0.00000
title: Mulliken charges with hydrogens summed into heavy atoms:
elementType: O O N C C C C C C C C C C C C C C C C C C
charge: -0.269762 -0.261169 -0.050979 -0.071054 0.044136 -0.164231 0.497270 0.339058 0.319192 0.115598 -0.305783 -0.183838 -0.139031 -0.163465 -0.002472 -0.016274 0.235675 0.143296 0.050341 -0.063822 -0.052686
polarizability: 2.97236461e+02 1.44993656e+01 1.79704162e+02 2.69063146e+00 2.30181136e+01 1.68578211e+02
1716.lowfreq: -4.3631 -2.8863 -0.0003 0.0001 0.0004 9.7717 21.1681 30.0932 45.6133
frequency: 21.0058 29.9739 45.5270 62.6395 74.0940 90.0953 113.3764 139.4594 142.6887 209.6961 225.2409 228.4235 250.6172 276.4805 297.9216 343.5270 370.3248 395.5926 415.9196 435.6650 450.2366 487.1794 490.5830 506.9243 541.1360 548.3157 564.1838 592.7147 595.4194 609.8468 627.5143 666.3172 719.0234 741.6399 754.2704 770.4997 773.0835 798.4516 819.3745 853.2530 862.6818 882.2995 885.8373 933.4266 938.8648 951.3832 955.4962 970.6295 978.4633 991.4175 1007.1424 1016.7123 1038.7388 1040.7811 1042.4879 1070.7322 1090.7595 1117.3371 1125.1902 1175.5687 1179.9120 1208.2125 1223.8524 1243.8885 1249.0314 1256.1389 1278.5931 1290.0328 1312.9285 1328.8940 1330.2993 1345.2775 1366.1655 1375.6156 1384.9601 1403.7633 1428.9327 1447.7900 1450.3925 1452.5385 1462.5108 1470.8088 1477.1898 1478.6393 1508.8367 1540.5601 1574.8263 1597.1880 1607.6093 1617.6758 1618.8295 2988.3327 2993.8259 2995.0323 3036.4448 3047.9207 3061.4420 3095.3428 3097.8304 3098.8715 3103.9553 3116.7487 3123.7987 3130.6988 3136.0658 3145.6203 3165.3648 3557.2915
redmass: 5.8835 7.6984 4.1698 2.2566 1.4193 3.6584 4.5456 4.5777 3.4527 4.3732 3.8722 4.2035 3.4424 5.6465 4.8211 3.9702 2.9770 3.8713 5.1133 4.0133 3.2616 4.3534 3.6948 3.1475 3.3902 3.3201 2.2141 2.6977 4.0604 2.3121 2.7065 5.5490 4.4478 4.0743 3.6987 1.8388 1.8950 4.7319 1.4873 3.3497 2.6656 2.0472 2.1147 1.7806 1.4230 3.1936 1.4627 3.8639 2.1500 1.3304 1.9219 1.3377 2.5975 1.8323 2.2420 2.1920 1.9782 2.3796 2.8813 1.1209 1.2280 2.3273 1.3636 1.3706 1.8280 2.2980 1.6217 1.3717 2.0000 1.3536 1.3934 1.4756 2.6219 1.9114 1.2314 1.8191 2.1391 2.4214 1.0510 1.1064 1.3436 1.3895 1.3508 1.6811 5.1057 5.9803 6.4487 7.1729 6.8498 5.2256 6.0699 1.0598 1.0632 1.0361 1.0857 1.0984 1.1030 1.0844 1.1006 1.0981 1.0882 1.0890 1.0866 1.0888 1.0944 1.0937 1.1007 1.0778
irintensity: 3.7136 4.3888 2.4066 4.6817 0.0580 1.3963 4.3364 3.3627 2.5140 4.4888 1.7356 2.1337 0.0584 1.7721 0.8230 3.8594 3.3452 2.8331 1.0776 2.7583 5.6378 8.3884 5.1129 11.1489 2.9436 23.8078 45.9684 8.4205 4.8656 2.4039 5.6604 1.7232 14.4650 4.1421 6.2595 35.9987 45.1947 0.7337 30.6983 5.3278 5.1923 3.1789 9.2414 8.4248 1.1864 1.4080 3.0374 1.8111 5.8907 0.0144 1.5319 0.0566 8.0865 7.0818 6.1083 1.6273 1.7758 9.7077 2.2632 2.0441 8.2810 4.6316 12.7850 13.9982 71.6077 11.0425 2.8535 7.4938 20.2402 12.4005 36.5912 5.8546 19.1109 35.5743 68.6356 17.2058 12.0292 0.7289 15.6080 3.5326 182.1987 69.5666 13.1171 62.5125 134.0687 131.9910 4.4135 2.2859 0.5535 38.3719 185.7562 18.7623 34.2079 8.1063 2.4215 27.9586 30.4398 12.1574 18.6377 7.4662 3.3716 11.4910 5.9484 2.1855 18.5400 19.6092 27.7974 37.1988
temp: 298.150 k
press: 1.00000 atm
elementType: 8 8 7 6 6 6 6 6 6 6 6 6 6 6 6 6 6 6 6 6 6 1 1 1 1 1 1 1 1 1 1 1 1 1 1 1 1 1
symmnumber: 1
zpe: 798870.2 jmol-1
zpe.correction: 0.304274 hartree
zpe.thermalcorrener: 0.322609 hartree
zpe.thermalcorrenthalpy: 0.323553 hartree
zpe.thermalcorrgfe: 0.256322 hartree
zpe.sumelectzpe: -899.818078 hartree
zpe.sumelectthermal: -899.799743 hartree
zpe.sumelectthermalent: -899.798799 hartree
zpe.sumelectthermalfe: -899.866030 hartree
dipole: -7.5057 -4.6350 -1.0364
dipole: 8.8821
quadrupole: -136.8817 -132.8647 -111.9184
quadrupole: -11.0131 -5.2121 5.2838
quadrupole: -9.6601 -5.6431 15.3032 -11.0131 -5.2121 5.2838
hfenergy: -900.122352 hartree
pointgroup: C01 [X(C18H17N1O2)]
dipole: -2.4626798 -2.4324117 -0.4797463 debye
polarizability: 285.6815738|34.5433993|194.7493003|8.3125106|24.8631015|165.0879607 unknown
InChI: InChI=1S/C18H17NO2/c1-12(20)19-18-10-9-13-5-2-3-7-15(13)16-8-4-6-14(21)11-17(16)18/h2-8,11,18-19H,9-10H2,1H3
charge 0 multiplicity 1
38 atoms
O  -0.493599 3.742624 -0.781694
O  4.540031 1.315831 1.013838
N  -1.187156 1.567432 -0.307442
C  -0.246065 1.400929 0.819065
C  -0.954468 0.959338 2.136589
C  -1.085235 -0.579335 2.315572
C  0.956606 0.494043 0.461928
C  -1.587871 -1.263485 1.057736
C  0.682161 -0.854868 -0.052811
C  -0.73603 -1.358955 -0.088778
C  2.198943 1.075568 0.672791
C  -2.89618 -1.801374 0.9927
C  -1.23441 -1.985738 -1.264533
C  1.642749 -1.740122 -0.548951
C  -3.379854 -2.422228 -0.180991
C  -2.543188 -2.51077 -1.317168
C  -1.234606 2.74686 -1.043425
C  3.592232 0.605229 0.51856
C  3.071865 -1.615072 -0.669292
C  3.921516 -0.619881 -0.225639
C  -2.247884 2.762765 -2.184304
H  0.144826 2.421709 0.975151
H  -0.380667 1.36179 2.992897
H  -1.95182 1.437656 2.157136
H  -0.09263 -0.987039 2.587501
H  -1.761058 -0.787896 3.16441
H  -1.797239 0.790898 -0.565555
H  2.192526 2.104911 1.060436
H  -3.53845 -1.735494 1.878955
H  -0.59542 -2.033932 -2.153474
H  1.250729 -2.705607 -0.895223
H  -4.396089 -2.830026 -0.209423
H  -2.907444 -2.979743 -2.237472
H  3.555029 -2.468434 -1.16555
H  4.99987 -0.741738 -0.395491
H  -2.813241 1.82004 -2.285457
H  -1.717776 2.965939 -3.130703
H  -2.958203 3.592175 -2.024289
