program: Gaussian 09
title: 000290080
version: EM64L-G09RevD.01
frameworkgroup: C1[X(C19H18O3)]
method: RPBEPBE
basis: SDD
operation: Freq
keyword: #pfreq=noraman
keyword: PBEPBE/SDD
title: #p freq=noraman PBEPBE/SDD
converged: NO YES NO NO
title: Mulliken charges:
elementType: O O O C C C C C C C C C C C C C C C C C C C H H H H H H H H H H H H H H H H H H
charge: -0.258069 -0.235782 -0.257442 -0.205162 -0.250384 -0.474530 0.373099 -0.559417 -0.590075 0.117286 0.374240 0.372605 -0.521671 0.141339 -0.351404 -0.562373 -0.445319 0.324228 -0.396332 -0.264521 -0.186312 -0.535216 0.261857 0.259051 0.242033 0.216432 0.228829 0.233806 0.253169 0.250032 0.240737 0.229851 0.260660 0.260718 0.245896 0.252222 0.257351 0.225036 0.248470 0.225061
chargesum: 0.00000
title: Mulliken charges with hydrogens summed into heavy atoms:
elementType: O O O C C C C C C C C C C C C C C C C C C C
charge: -0.258069 -0.235782 -0.257442 0.056696 0.008666 -0.016065 0.373099 -0.056216 -0.127439 0.117286 0.374240 0.372605 -0.280934 0.141339 -0.121553 -0.301712 -0.184601 0.324228 -0.150436 -0.012298 0.071038 0.163352
polarizability: 3.39496593e+02 1.91253086e+01 2.29235304e+02 -2.50596219e+00 -2.33149381e+00 1.29144106e+02
1716.lowfreq: -18.8871 -10.3820 -0.0009 -0.0008 -0.0005 4.0107 16.0264 39.2164 53.1414
frequency: 12.6539 39.2021 53.1363 58.9323 80.9773 95.6024 124.3911 144.7524 167.0901 186.1688 218.2450 221.9817 239.5094 259.2189 285.8846 302.7412 332.9861 361.0935 383.5066 398.1287 439.0715 467.3907 494.0600 506.5460 534.8178 552.3694 582.3407 592.8958 597.5854 623.4665 652.6287 680.9361 704.5572 719.9567 721.7553 745.0488 805.9106 815.0312 819.1306 825.3814 855.5562 869.6110 874.6964 880.3328 881.6888 891.6328 897.3594 909.8773 950.3458 954.0120 991.4744 1002.3609 1009.0520 1026.1448 1044.4548 1058.9498 1083.8775 1097.2477 1112.3090 1126.4941 1130.5804 1145.8904 1146.3851 1173.5993 1180.9900 1188.7074 1215.2477 1223.0169 1236.9020 1247.3474 1256.3689 1266.1681 1274.7851 1288.1398 1298.8872 1302.7198 1317.6661 1332.1164 1334.5642 1361.0770 1367.7316 1381.5833 1436.1235 1441.2541 1443.2479 1454.0934 1467.5460 1471.4758 1472.8664 1489.3861 1492.1894 1557.4587 1569.3856 1584.5538 1589.2613 1626.8300 2937.3911 2960.1468 2966.1557 2981.8287 2986.9610 2994.3467 3036.0080 3056.8125 3056.9108 3073.5288 3130.4771 3141.6346 3146.7998 3152.3944 3172.3439 3215.9311 3231.0547 3267.2198
redmass: 4.1183 4.6040 5.0175 5.0665 4.2136 3.3240 4.5616 4.4492 2.9239 4.0654 1.1854 3.7601 3.1365 5.1600 3.4413 4.3726 4.5500 4.1266 4.2728 5.3985 2.8447 4.0981 3.6260 4.1628 3.1081 3.9972 3.3465 3.0649 3.2240 4.4650 3.1896 4.1487 5.4959 5.1304 1.3234 3.0332 2.3636 1.4761 1.6091 2.9197 2.4033 5.9923 1.3937 2.4283 2.6387 2.7019 1.6524 2.0744 1.6254 1.7307 3.1493 2.8808 2.1017 2.9415 2.3431 2.3352 2.8820 2.3503 1.2586 1.5476 1.5209 1.4976 1.4128 1.4138 1.7042 1.5756 2.2408 1.6766 1.9431 1.6295 1.9567 1.3800 2.1881 1.3402 2.0169 1.3662 1.6812 1.4661 1.8514 1.8409 2.1390 6.1803 1.3319 1.1570 2.4636 1.1315 1.0498 1.0890 1.1076 2.4858 5.1567 8.0273 8.0181 6.3669 6.8836 7.0109 1.0801 1.0664 1.0327 1.0729 1.0635 1.0737 1.0938 1.1037 1.1010 1.0970 1.0999 1.0903 1.0916 1.0864 1.0952 1.0926 1.0984 1.1082
irintensity: 0.7076 0.3389 0.8195 0.4180 4.5082 5.0983 1.2652 1.6445 2.0289 1.1006 0.0906 1.1513 3.1279 0.5792 2.5775 4.7775 4.9349 5.1017 15.5796 3.0711 7.1388 1.8631 4.7016 2.1798 9.9087 10.4726 10.0090 7.1233 2.5774 2.9865 3.1887 2.2398 1.0826 3.3910 77.9705 0.5909 17.1357 37.2918 18.0855 1.3363 8.8936 2.6169 0.2630 5.3801 1.5620 0.4730 60.7337 1.5133 0.7397 3.6609 22.0995 23.9664 28.1930 41.1637 1.7930 1.2615 20.2360 1.5192 0.1566 18.4443 21.9388 60.6598 5.3974 33.0554 26.6035 16.7445 4.9944 15.1215 42.5350 122.5348 248.8955 16.3321 95.9301 32.2036 52.1688 16.3409 2.3580 1.2654 42.0796 9.1899 10.7140 63.1947 10.3187 11.1238 3.5908 13.4688 14.2327 13.7792 58.1142 57.3548 12.5269 141.9574 24.0371 485.9429 74.4693 124.9728 2.6578 17.5218 81.1037 2.0185 19.5164 26.5945 33.0730 29.3542 48.7644 15.1939 25.5022 12.0899 7.3742 2.4446 19.0706 5.6960 0.4325 0.6779
temp: 298.150 k
press: 1.00000 atm
elementType: 8 8 8 6 6 6 6 6 6 6 6 6 6 6 6 6 6 6 6 6 6 6 1 1 1 1 1 1 1 1 1 1 1 1 1 1 1 1 1 1
symmnumber: 1
zpe: 841205.9 jmol-1
zpe.correction: 0.320398 hartree
zpe.thermalcorrener: 0.339150 hartree
zpe.thermalcorrenthalpy: 0.340095 hartree
zpe.thermalcorrgfe: 0.271761 hartree
zpe.sumelectzpe: -958.895285 hartree
zpe.sumelectthermal: -958.876533 hartree
zpe.sumelectthermalent: -958.875589 hartree
zpe.sumelectthermalfe: -958.943923 hartree
dipole: -3.0841 -4.3237 -0.3906
dipole: 5.3253
quadrupole: -97.3060 -147.3839 -126.8055
quadrupole: -21.0470 -2.0942 -0.2216
quadrupole: 26.5258 -23.5521 -2.9737 -21.0470 -2.0942 -0.2216
hfenergy: -959.2156835 hartree
pointgroup: C01 [X(C19H18O3)]
dipole: -1.2192249 1.6926906 0.1946392 debye
polarizability: 339.5850518|-18.8672249|229.1770977|2.9365839|0.3312802|129.1138538 unknown
InChI: InChI=1S/C19H18O3/c1-21-14-5-7-15-12(9-14)4-6-16-17(15)10-13(20)11-18(16)19-3-2-8-22-19/h2-3,5,7-10,16,18H,4,6,11H2,1H3
charge 0 multiplicity 1
40 atoms
O  3.691516 0.952237 -1.062519
O  1.639506 -4.055343 -0.0874
O  -5.552516 1.200694 -0.06806
C  0.930553 0.137371 -0.088632
C  2.281857 -0.458359 0.416913
C  0.54652 1.421079 0.685259
C  -0.207386 -0.890305 -0.031205
C  2.579812 -1.808109 -0.289322
C  -0.726333 2.043099 0.088694
C  -1.598647 -0.373285 -0.029905
C  -1.866356 1.037466 0.023715
C  3.422765 0.503044 0.255273
C  0.078989 -2.242013 0.001019
C  1.432119 -2.798643 -0.108666
C  -2.718492 -1.251448 -0.107296
C  -3.193513 1.504452 0.011469
C  4.347578 1.067101 1.11897
C  -4.285378 0.609305 -0.062121
C  -4.043979 -0.788379 -0.123439
C  5.233992 1.901319 0.329237
C  4.808116 1.808744 -0.982529
C  -6.720479 0.315134 -0.136468
H  1.073399 0.424261 -1.154814
H  2.179114 -0.6513 1.504473
H  1.382774 2.141551 0.638347
H  0.382599 1.172987 1.753121
H  -0.501776 2.405128 -0.936914
H  -1.041512 2.929541 0.669538
H  3.509352 -2.266763 0.089406
H  2.723592 -1.629427 -1.374164
H  -0.709085 -2.99812 0.082028
H  -2.557341 -2.33146 -0.16973
H  -3.404737 2.57793 0.061317
H  4.394113 0.904424 2.194298
H  -4.866596 -1.506281 -0.186446
H  6.07481 2.488799 0.692811
H  5.14055 2.237627 -1.923517
H  -6.720021 -0.277291 -1.071471
H  -7.589873 0.988067 -0.123324
H  -6.759605 -0.364436 0.736352
