program: Gaussian 09
title: 000290078
version: EM64L-G09RevD.01
frameworkgroup: C1[X(C8H12O2)]
method: RPBEPBE
basis: SDD
operation: Freq
keyword: #pfreq=noraman
keyword: PBEPBE/SDD
title: #p freq=noraman PBEPBE/SDD
converged: YES YES NO NO
title: Mulliken charges:
elementType: O O C C C C C C C C H H H H H H H H H H H H
charge: -0.418214 -0.230382 -0.126293 -0.456740 -0.400866 -0.486075 -0.431716 -0.190850 -0.175751 0.123403 0.266111 0.209759 0.245285 0.204241 0.213202 0.231295 0.226718 0.209660 0.204859 0.204539 0.201975 0.375839
chargesum: 0.00000
title: Mulliken charges with hydrogens summed into heavy atoms:
elementType: O O C C C C C C C C
charge: -0.042375 -0.230382 0.139818 -0.001696 0.016576 -0.028062 -0.017197 0.013689 0.026224 0.123403
polarizability: 1.05588707e+02 -2.26123455e+00 8.74981659e+01 6.60564166e+00 -4.58659998e-01 6.88942964e+01
1716.lowfreq: -10.5961 -0.0004 0.0006 0.0008 10.6420 12.7208 25.5309 70.3812 140.5268
frequency: 25.4220 70.3718 140.5041 180.4161 245.2413 268.0357 307.5963 329.2811 404.9365 442.9421 526.2597 590.6880 601.3787 635.2797 685.3848 707.7331 786.2343 827.1057 863.8832 905.4459 911.6058 941.5032 959.3293 974.0749 1028.2817 1043.5839 1060.8238 1091.2598 1137.0115 1150.8043 1209.1551 1211.6219 1235.2023 1250.5471 1267.4648 1299.0759 1326.0602 1329.0620 1344.5378 1350.7595 1377.5842 1386.5572 1458.3978 1460.2186 1472.0513 1480.7937 1657.4278 1677.2737 2947.3953 2973.0386 2977.9939 2984.4062 3009.2574 3020.9279 3034.0887 3035.5215 3054.6426 3078.3098 3112.1956 3505.6839
redmass: 7.7487 2.8959 2.5352 3.5589 2.3093 4.2984 2.6444 2.9223 2.4685 3.3833 3.0219 2.6931 1.4372 1.4366 2.1965 2.7785 2.6949 1.7917 2.7217 2.7244 2.4671 2.3672 1.8745 1.4410 1.9853 2.3176 2.0304 2.1634 1.6859 1.4558 1.2812 1.2332 1.3732 1.0842 1.2527 1.3343 1.3773 1.4615 1.5375 1.3487 1.6021 1.4722 1.0983 1.0798 1.0780 1.0837 8.3631 6.6895 1.0657 1.0629 1.0614 1.0659 1.0909 1.0859 1.0978 1.0975 1.0997 1.0839 1.0973 1.0638
irintensity: 1.1444 0.1436 1.8328 0.0884 1.1507 1.4335 3.1980 0.3656 3.4978 11.0626 0.9206 46.3111 75.5761 43.4170 51.9539 20.0547 7.9604 14.9963 3.4947 12.4933 3.7528 4.7847 30.2795 4.8725 18.7319 185.3547 1.2739 49.8602 0.7189 3.6742 5.8243 1.2397 1.1772 0.3268 9.4426 26.5228 1.9702 30.6785 2.1472 0.6823 7.3121 0.3588 1.1481 19.5186 11.0722 12.2314 226.6587 3.1139 34.7904 18.1732 18.6872 29.7817 51.6843 8.2669 4.1761 41.4150 49.2992 9.1038 62.7964 18.2830
temp: 298.150 k
press: 1.00000 atm
elementType: 8 8 6 6 6 6 6 6 6 6 1 1 1 1 1 1 1 1 1 1 1 1
symmnumber: 1
zpe: 486698.7 jmol-1
zpe.correction: 0.185374 hartree
zpe.thermalcorrener: 0.195140 hartree
zpe.thermalcorrenthalpy: 0.196084 hartree
zpe.thermalcorrgfe: 0.149447 hartree
zpe.sumelectzpe: -461.704265 hartree
zpe.sumelectthermal: -461.694499 hartree
zpe.sumelectthermalent: -461.693554 hartree
zpe.sumelectthermalfe: -461.740192 hartree
dipole: -1.0740 -0.8295 -0.6557
dipole: 1.5071
quadrupole: -57.1325 -60.8602 -61.4759
quadrupole: -5.8984 -1.8424 -3.2078
quadrupole: 2.6904 -1.0374 -1.6531 -5.8984 -1.8424 -3.2078
hfenergy: -461.8896388 hartree
pointgroup: C01 [X(C8H12O2)]
dipole: -0.4348454 0.1867225 0.3572708 debye
dipolederiv: -0.5528218 -0.2169318 -0.4081509 -0.2043061 -0.5681506 -0.2938613 -0.3884051 -0.2678363 -0.8452995 -0.822047 0.1614057 0.2553004 -0.0234231 -0.4506294 -0.2228867 0.0785544 -0.2731345 -0.7100761 -0.3522565 0.0414874 -0.0066669 0.1303251 0.0098462 -0.0302118 -0.0154122 -0.0328719 0.0876024 0.0025697 -0.0039651 0.0083643 0.0488462 0.1097167 -0.0221633 0.0321377 -0.0372698 0.0798933 0.0588507 -0.0310645 0.0021963 -0.036556 0.1051305 -0.0179306 0.0153803 0.0008334 0.1017501 0.0069968 0.0334555 0.0541031 -0.0950906 0.0769178 -0.0239574 0.1757077 -0.0018981 0.1426153 0.083392 0.0431132 0.0498171 0.0229938 -0.0297538 -0.0505749 0.0815269 -0.0172456 0.1220074 0.1450482 -0.0603911 -0.1505402 -0.0736319 -0.003488 0.0873807 -0.2268744 0.0678133 -0.1830349 -0.0417821 -0.035452 -0.0866039 0.03325 0.2382593 0.0532046 -0.0855246 0.057433 -0.2043119 1.401034 0.006685 0.068394 0.15847 0.4838411 0.5717707 0.1301758 0.5932145 1.1194291 0.0788536 -0.0104609 0.0345896 -0.0253885 0.0379364 0.0028745 0.0171117 0.0015956 -0.0827615 0.0417283 0.0097924 -0.0380077 0.0349007 -0.1117628 0.0812286 -0.056439 0.1168906 -0.0110817 0.0312609 0.0423129 0.0936544 -0.0035746 0.069876 -0.0076921 0.068431 -0.0427096 -0.0538674 0.0015797 -0.0560425 -0.0251787 -0.0871664 -0.166502 -0.1108112 -0.0193919 -0.0878385 0.0472393 0.0145144 0.0274447 0.0050001 0.0549876 0.0072711 0.1400321 -0.016595 0.0865786 -0.080171 0.0076538 0.0163888 0.0187796 0.0707146 0.0944906 -0.0340186 0.0223595 0.0362695 -0.1289452 -0.0226908 -0.0980233 -0.0090774 -0.0923679 -0.0674482 -0.0341712 -0.0389045 -0.0598246 0.0768833 0.1076041 0.0662961 -0.0645238 -0.0142309 -0.0513988 0.0866454 -0.0226036 0.0811857 -0.1037108 -0.196868 -0.0582489 -0.0134002 -0.0497258 0.0250128 -0.015694 -0.0468159 -0.0594111 0.0775965 -0.0003555 0.0311833 0.0370567 0.0594017 -0.1509164 -0.0532222 0.0583633 -0.0618727 0.1415089 -0.0977015 0.0826749 0.1098172 0.061037 -0.0138845 -0.0691977 0.1114606 -0.0625828 0.100161 0.1054369 0.0083403 0.0650768 0.0305349 0.3556361 -0.0367436 0.125757 -0.0373186 0.3065736 unknown
polarizability: 105.5697941|5.045591|85.1172003|-4.5767868|6.4674469|71.2941748 unknown
InChI: InChI=1S/C8H12O2/c9-8(10)7-5-3-1-2-4-6-7/h1,3,7,9H,2,4-6H2
charge 0 multiplicity 1
22 atoms
O  2.63341 0.537964 1.197987
O  2.767295 -0.646095 -0.789781
C  0.539483 -0.181174 0.222221
C  -0.029723 -1.420266 -0.515869
C  -1.538084 -1.336161 -0.846906
C  -0.021387 1.182754 -0.308658
C  -2.43634 -0.848912 0.317265
C  -1.400359 1.520165 0.243584
C  -2.406778 0.655545 0.547503
C  2.058365 -0.160069 0.119664
H  0.289144 -0.223438 1.298216
H  0.160317 -2.314717 0.110451
H  0.542985 -1.567849 -1.450925
H  -1.872637 -2.341399 -1.170392
H  -1.698012 -0.663426 -1.711618
H  -0.025159 1.167452 -1.417895
H  0.670172 1.993453 -0.011817
H  -2.166742 -1.386164 1.252847
H  -3.485729 -1.136505 0.107096
H  -1.572264 2.587928 0.443226
H  -3.31913 1.083271 0.99003
H  3.621477 0.566742 1.073971
