program: Gaussian 09
title: 000290076
version: EM64L-G09RevD.01
frameworkgroup: C1[X(C15H18O6)]
method: RPBEPBE
basis: SDD
operation: Freq
keyword: #pfreq=noraman
keyword: PBEPBE/SDD
title: #p freq=noraman PBEPBE/SDD
converged: YES YES NO NO
title: Mulliken charges:
elementType: O O O O O O C C C C C C C C C C C C C C C H H H H H H H H H H H H H H H H H H
charge: -0.302494 -0.295551 -0.285845 -0.260925 -0.256687 -0.238820 0.458657 0.289072 -0.392624 -0.508046 0.199638 -0.643485 -0.403457 0.190877 -0.351503 0.139217 0.269856 -0.530425 -0.530814 -0.503106 -0.507164 0.262219 0.307268 0.263912 0.275705 0.243412 0.253188 0.232868 0.222117 0.250929 0.259706 0.226596 0.231001 0.243255 0.231282 0.240971 0.244507 0.241241 0.233454
chargesum: 0.00000
title: Mulliken charges with hydrogens summed into heavy atoms:
elementType: O O O O O O C C C C C C C C C C C C C C C
charge: -0.302494 -0.295551 -0.285845 -0.260925 -0.256687 -0.238820 0.458657 0.289072 -0.130405 -0.200778 0.199638 -0.103869 -0.160045 0.190877 -0.098316 0.139217 0.269856 0.175490 0.186488 0.212402 0.212038
polarizability: 3.16538433e+02 -1.62081162e+00 1.93980136e+02 -4.24259715e+00 -2.35124755e+00 1.11429105e+02
1716.lowfreq: -7.9339 -0.0007 -0.0003 0.0004 2.5596 7.0907 18.4450 24.2275 36.5710
frequency: 18.3590 24.1130 36.5378 43.5340 49.5058 66.5343 86.8472 96.6896 99.1365 103.8190 114.9144 138.8197 148.7994 153.7139 160.0982 169.4076 189.2373 195.0916 229.7581 245.0403 253.3387 295.0443 312.2473 335.0435 348.1025 391.4559 393.0289 421.5480 461.1923 491.6825 528.2861 529.2286 557.4111 585.9614 627.1294 673.1163 681.5764 706.4642 727.2369 746.3514 757.0248 802.3008 837.7120 848.3692 887.8479 921.4951 929.7443 938.6974 946.5907 954.2009 964.1208 982.5957 990.3997 1066.9797 1096.4668 1112.6123 1113.5725 1114.9769 1116.0693 1131.2222 1145.3566 1147.5694 1148.4568 1154.6244 1159.9908 1180.2208 1208.6603 1235.5825 1256.5471 1289.6396 1317.8746 1353.1853 1382.5970 1404.2698 1420.5578 1422.6114 1424.7547 1441.2276 1445.8838 1451.3461 1451.9932 1457.8631 1459.8304 1463.6730 1464.2043 1477.3592 1484.4769 1489.5320 1554.4676 1598.0931 1608.8249 1639.4292 1645.7108 2971.0764 2976.9465 3002.4891 3004.8455 3005.9555 3066.1880 3075.0027 3092.4924 3094.5428 3103.3142 3107.1793 3121.9744 3125.8907 3135.6238 3146.4671 3150.4578 3163.1123 3167.0182
redmass: 5.3387 4.5579 4.6064 5.5098 4.1291 4.8282 3.9642 1.6788 1.0908 1.9104 2.8237 3.6580 2.5292 2.5119 1.5497 1.2359 3.0064 4.0358 4.8298 6.1842 4.8202 4.2655 4.3407 4.4803 4.6221 3.0113 5.2205 5.2961 4.4992 3.4982 6.1884 6.5276 3.6881 4.2543 3.9740 4.9474 6.0874 6.2593 5.9798 4.3834 4.4679 4.2503 1.5779 5.9260 6.4266 1.6319 2.5361 3.9626 6.0265 1.8340 1.4481 3.8406 3.4238 3.6185 2.7750 1.2696 1.2476 1.2668 1.2410 3.0468 1.5059 1.4790 1.4519 1.3274 1.6955 2.2632 1.6802 2.1308 1.4733 2.6367 1.5585 4.5800 2.3208 2.2190 1.1869 1.1943 1.1828 1.1691 1.3054 1.0498 1.0501 1.0552 1.0712 1.0511 1.0528 1.0786 2.6092 1.0524 7.0442 8.6209 6.8858 8.6453 8.1559 1.0310 1.0308 1.0297 1.0391 1.0539 1.1041 1.1043 1.0927 1.0905 1.1043 1.1045 1.1024 1.1032 1.0888 1.1047 1.1048 1.0926 1.0958
irintensity: 1.9575 0.0406 1.3975 1.7838 0.5362 0.2991 3.1271 1.8087 0.4214 0.6759 9.9569 1.3522 2.4499 0.8972 1.1977 1.2806 7.3491 3.0737 5.1207 4.2055 17.2906 24.0339 1.8028 11.5505 1.8223 3.7649 7.3775 1.2938 2.9994 18.6260 31.9197 3.9017 5.5936 17.1272 7.7480 16.3731 3.4764 9.4474 21.8416 4.0620 9.2549 5.2378 36.1731 3.5906 7.5350 26.1536 12.8895 60.9321 25.2439 44.3972 3.8634 48.0359 7.8345 197.1907 64.2400 0.4846 41.4311 0.4182 3.4818 457.1884 48.9901 84.2881 19.8545 1.3686 15.1090 199.3913 12.0875 281.7104 14.5708 42.5398 73.3254 60.9921 9.9074 23.2246 19.4156 28.2449 4.0232 8.9225 48.7502 13.0788 13.4399 16.8125 8.1333 2.0297 28.4138 14.0578 151.9044 22.2090 19.7285 259.2989 39.3355 147.4522 65.6519 70.5784 84.5709 45.4649 34.6708 7.4007 29.0061 22.1472 0.7905 0.8084 25.0008 23.3462 22.0590 25.0083 5.9236 16.9357 17.9430 1.7802 14.7235
temp: 298.150 k
press: 1.00000 atm
elementType: 8 8 8 8 8 8 6 6 6 6 6 6 6 6 6 6 6 6 6 6 6 1 1 1 1 1 1 1 1 1 1 1 1 1 1 1 1 1 1
symmnumber: 1
zpe: 796984.4 jmol-1
zpe.correction: 0.303555 hartree
zpe.thermalcorrener: 0.326651 hartree
zpe.thermalcorrenthalpy: 0.327595 hartree
zpe.thermalcorrgfe: 0.248147 hartree
zpe.sumelectzpe: -1032.109941 hartree
zpe.sumelectthermal: -1032.086845 hartree
zpe.sumelectthermalent: -1032.085901 hartree
zpe.sumelectthermalfe: -1032.165349 hartree
dipole: -0.5630 2.6699 -1.6992
dipole: 3.2145
quadrupole: -95.5077 -115.0399 -127.0990
quadrupole: 5.4320 -4.2706 -1.0786
quadrupole: 17.0412 -2.4910 -14.5502 5.4320 -4.2706 -1.0786
hfenergy: -1032.413496 hartree
pointgroup: C01 [X(C15H18O6)]
dipole: -0.3370963 -1.0996088 0.525931 debye
polarizability: 315.3204939|-12.7292203|194.4285488|0.9807191|8.6496016|112.1986309 unknown
InChI: InChI=1S/C15H18O6/c1-18-12-6-5-10(8-13(12)19-2)7-11(15(17)21-4)9-14(16)20-3/h5-8H,9H2,1-4H3
charge 0 multiplicity 1
39 atoms
O  -3.224845 -1.277695 -0.427565
O  -4.851498 1.001288 0.437977
O  4.214264 0.146414 0.272577
O  2.520685 -2.975493 0.119043
O  3.567009 2.331373 -0.216703
O  1.339459 -1.758418 -1.473464
C  -0.604032 1.315135 0.196426
C  1.873621 0.625268 0.312511
C  0.849229 1.520608 0.118067
C  -1.246774 0.091047 -0.148038
C  -2.645342 -0.040506 -0.054843
C  1.727588 -0.808745 0.78867
C  -1.417439 2.412442 0.608959
C  -3.446421 1.071328 0.343093
C  -2.815819 2.287646 0.690097
C  3.252214 1.154299 0.095593
C  1.830454 -1.84785 -0.324903
C  -3.91446 -1.985404 0.67662
C  -5.557986 0.683968 -0.828588
C  5.616629 0.563911 0.052925
C  2.648994 -4.074891 -0.869756
H  1.170768 2.548952 -0.106982
H  -0.678255 -0.748758 -0.55871
H  0.738352 -0.938816 1.267554
H  2.499528 -1.044063 1.537823
H  -0.941621 3.36557 0.866583
H  -3.447699 3.126551 0.997957
H  -4.332798 -2.896771 0.223324
H  -3.188245 -2.256818 1.466192
H  -4.718967 -1.362074 1.10779
H  -5.18641 -0.25946 -1.265761
H  -5.420958 1.511437 -1.54959
H  -6.619923 0.596882 -0.553964
H  5.746045 0.940921 -0.975603
H  6.210139 -0.345673 0.221408
H  5.89524 1.35976 0.764324
H  3.212931 -3.726588 -1.751111
H  1.651948 -4.419327 -1.19222
H  3.192494 -4.867951 -0.337712
