program: Gaussian 09
title: 000290075
version: EM64L-G09RevD.01
frameworkgroup: C1[X(C13H14O6)]
method: RPBEPBE
basis: SDD
operation: Freq
keyword: #pfreq=noraman
keyword: PBEPBE/SDD
title: #p freq=noraman PBEPBE/SDD
converged: YES YES NO NO
title: Mulliken charges:
elementType: O O O O O O C C C C C C C C C C C C C H H H H H H H H H H H H H H
charge: -0.303228 -0.292898 -0.442314 -0.408010 -0.253214 -0.224120 0.484542 -0.489661 -0.366336 0.197892 0.267413 -0.407533 0.192510 -0.353549 -0.658183 0.102665 0.193929 -0.530204 -0.530722 0.280969 0.269925 0.241655 0.254969 0.280548 0.297228 0.224600 0.250741 0.234909 0.260716 0.232881 0.227888 0.384999 0.378993
chargesum: 0.00000
title: Mulliken charges with hydrogens summed into heavy atoms:
elementType: O O O O O O C C C C C C C C C C C C C
charge: -0.303228 -0.292898 -0.057315 -0.029017 -0.253214 -0.224120 0.484542 -0.208692 -0.096411 0.197892 0.267413 -0.165878 0.192510 -0.098579 -0.080408 0.102665 0.193929 0.180045 0.190763
polarizability: 2.82094643e+02 1.56483769e-01 1.69995970e+02 5.12887834e+00 -3.00220337e+00 9.66033989e+01
1716.lowfreq: -9.2509 -1.1343 -0.0007 -0.0005 -0.0004 5.7152 17.3994 28.6852 45.9220
frequency: 17.3256 28.6081 45.8803 52.3443 62.7866 74.3059 97.5391 110.5412 121.8712 142.0657 155.8421 167.5207 185.6347 192.5138 244.2341 271.6554 300.1737 324.1242 348.9352 365.8797 388.1113 428.9376 451.9108 483.6227 494.0825 509.6284 545.0184 561.3508 574.0428 605.4256 611.3976 644.1298 654.6119 705.1457 720.7174 748.8268 756.3763 808.8965 837.9878 861.9449 896.2988 900.2603 938.9216 939.8422 953.8449 964.3590 986.8106 1021.5599 1055.3535 1094.0178 1111.9766 1115.2421 1130.7876 1147.1285 1154.2022 1159.7377 1206.1671 1222.3555 1248.2645 1255.5204 1263.8965 1323.0862 1341.8985 1363.8328 1392.8472 1406.8122 1424.6021 1435.7202 1445.1117 1457.3660 1460.2508 1476.6828 1484.9537 1488.5380 1554.9344 1603.3615 1617.5492 1642.4403 1666.9521 2973.8697 2979.1895 3010.7535 3069.6223 3074.5340 3077.7610 3120.8080 3124.6211 3128.2988 3135.9811 3166.9627 3185.2272 3512.7271 3537.5038
redmass: 5.4827 7.6692 4.7901 8.5447 8.3028 5.5912 5.0392 3.7094 3.2402 2.6957 1.3207 1.1299 3.5549 4.3253 5.1334 5.2645 4.7500 3.7568 4.8522 4.6302 5.0162 5.2656 3.7988 2.9109 2.3665 3.5857 6.4486 1.5418 3.1807 3.9066 3.2381 1.5896 3.6667 6.2003 6.7874 3.5963 4.8534 3.4730 1.5773 4.4302 6.1703 1.5378 1.7601 5.0883 2.6141 1.4267 3.4050 3.5357 2.3924 2.7892 1.2442 1.2436 1.6375 1.4530 1.3196 1.7206 1.4516 1.5110 1.7900 1.9467 1.6644 2.9931 1.9334 4.4454 2.1737 1.9667 1.1863 1.1916 1.4280 1.0606 1.0676 1.0755 2.6711 1.0524 7.0410 6.7360 8.0699 7.5871 8.2730 1.0309 1.0307 1.0611 1.1041 1.0979 1.1042 1.0886 1.1025 1.1034 1.0889 1.0958 1.0913 1.0640 1.0643
irintensity: 0.7036 0.5023 0.3506 0.8973 1.8267 1.1480 4.0431 5.6422 5.2357 0.6553 0.2894 0.0646 3.5225 5.7567 10.8332 0.7552 5.1069 1.1349 0.5213 1.6559 9.9690 6.8428 2.1463 21.1782 13.0752 76.7866 30.2995 118.9062 53.6795 18.4666 44.9027 85.4170 6.6369 13.5022 21.8962 9.6426 4.5316 16.2996 44.4851 0.7051 11.4873 10.5343 25.2041 67.0482 50.7860 5.6966 48.2511 290.1165 358.4924 76.3931 39.4161 4.1230 118.9348 4.4338 4.5977 15.7208 4.2948 38.9603 104.5964 86.7373 77.0124 20.3142 78.5941 124.2843 11.0065 31.8787 1.1970 40.2521 42.5570 13.7467 8.0205 12.9549 106.5985 23.7657 13.8129 229.6389 132.3247 258.1493 180.3645 67.4585 81.8351 5.6578 27.3651 0.0142 21.4660 0.2815 20.9155 22.9313 6.2805 8.5446 0.9125 28.0846 56.4297
temp: 298.150 k
press: 1.00000 atm
elementType: 8 8 8 8 8 8 6 6 6 6 6 6 6 6 6 6 6 6 6 1 1 1 1 1 1 1 1 1 1 1 1 1 1
symmnumber: 1
zpe: 652881.7 jmol-1
zpe.correction: 0.248670 hartree
zpe.thermalcorrener: 0.268240 hartree
zpe.thermalcorrenthalpy: 0.269184 hartree
zpe.thermalcorrgfe: 0.198189 hartree
zpe.sumelectzpe: -953.685866 hartree
zpe.sumelectthermal: -953.666295 hartree
zpe.sumelectthermalent: -953.665351 hartree
zpe.sumelectthermalfe: -953.736346 hartree
dipole: 3.6317 -0.2858 -0.9721
dipole: 3.7704
quadrupole: -106.3639 -93.9811 -115.1591
quadrupole: 8.6873 1.7033 -3.2214
quadrupole: -1.1959 11.1869 -9.9910 8.6873 1.7033 -3.2214
hfenergy: -953.9345351 hartree
pointgroup: C01 [X(C13H14O6)]
dipole: -1.4132753 -0.0818531 0.4431398 debye
polarizability: 282.1732676|2.4963235|169.3285237|-1.0360217|-7.8765721|97.1922208 unknown
InChI: InChI=1S/C13H14O6/c1-18-10-4-3-8(6-11(10)19-2)5-9(13(16)17)7-12(14)15/h3-6,14,16H,7H2,1-2H3
charge 0 multiplicity 1
33 atoms
O  -2.696849 1.499486 -0.455641
O  -4.359783 -0.745651 0.444712
O  3.872185 -2.345414 -0.23508
O  2.627721 3.216983 -0.280123
O  4.796973 -0.251416 0.148893
O  2.076252 1.602604 -1.854018
C  -0.117597 -1.128985 0.189245
C  -0.74509 0.099801 -0.166416
C  1.329183 -1.370245 0.112284
C  -2.140215 0.256408 -0.071149
C  2.376523 -0.484722 0.214696
C  -0.949477 -2.205489 0.621848
C  -2.958613 -0.837186 0.343919
C  -2.344761 -2.057697 0.707194
C  2.285526 0.989538 0.550478
C  3.76858 -0.971747 0.050924
C  2.316411 1.906057 -0.666807
C  -3.362659 2.237321 0.644749
C  -5.073247 -0.41025 -0.814083
H  -0.174367 0.932912 -0.583122
H  1.614299 -2.422311 -0.022464
H  -0.488757 -3.162913 0.89101
H  -2.988216 -2.882027 1.029701
H  1.359272 1.210571 1.112534
H  3.135457 1.27999 1.191974
H  -2.624231 2.503111 1.424509
H  -4.177148 1.63767 1.090339
H  -3.764481 3.151104 0.181862
H  -4.685231 0.52427 -1.255513
H  -6.129338 -0.299381 -0.526493
H  -4.963273 -1.240801 -1.535888
H  4.835439 -2.570008 -0.333762
H  2.630811 3.801816 -1.086215
