program: Gaussian 09
title: 000290068
version: EM64L-G09RevD.01
frameworkgroup: C1[X(C14H17NO)]
method: RPBEPBE
basis: SDD
operation: Freq
keyword: #p
keyword: freq=noraman
keyword: PBEPBE/SDD
title: #p freq=noraman PBEPBE/SDD
converged: YES YES NO NO
title: Mulliken charges:
elementType: O N C C C C C C C C C C C C C C H H H H H H H H H H H H H H H H H
charge: -0.207685 -0.661036 -0.220534 -0.123889 0.247136 -0.517396 -0.560295 -0.482412 -0.466527 0.048881 0.245774 -0.357061 -0.300558 -0.236083 -0.262928 -0.226858 0.274823 0.231009 0.251871 0.218494 0.201240 0.255370 0.229663 0.189656 0.197792 0.229532 0.273770 0.273463 0.273476 0.293843 0.230153 0.227453 0.229864
chargesum: 0.00000
title: Mulliken charges with hydrogens summed into heavy atoms:
elementType: O N C C C C C C C C C C C C C C
charge: -0.207685 -0.113803 0.054289 0.107121 0.247136 -0.047032 -0.103685 -0.063094 -0.039202 0.048881 0.245774 -0.083585 -0.006715 -0.005929 -0.035476 0.003006
polarizability: 2.01949962e+02 -6.23337088e+00 1.47804481e+02 -1.26810101e+01 -2.65926079e+00 1.06604450e+02
1716.lowfreq: -14.7279 -8.2705 -0.0005 -0.0004 0.0003 14.5818 33.1746 53.2697 97.2529
frequency: 32.5360 53.2402 97.2308 105.5197 146.0616 201.4559 211.4466 255.5571 268.8477 327.7860 336.7338 379.9027 401.7450 405.6309 440.8668 444.8881 486.0293 541.2167 582.7126 614.9447 625.0546 670.6729 695.3864 712.7489 752.4623 773.3204 795.6152 802.8561 822.4656 845.3563 864.6871 890.0341 910.4150 926.3746 934.5153 955.5549 956.6561 970.5422 987.0129 988.7543 997.3893 1006.2293 1020.0403 1027.2462 1045.1894 1059.0699 1082.1688 1084.3696 1114.5670 1130.4624 1157.1185 1171.7237 1177.3951 1184.1197 1199.7863 1222.7570 1231.5409 1252.3543 1261.6965 1273.7506 1291.6904 1294.1316 1304.3842 1315.6824 1317.8381 1383.5933 1433.4601 1465.3750 1471.5508 1473.8807 1477.7691 1496.6914 1553.2808 1587.6828 1607.0188 1630.9776 2989.1526 2995.5355 3004.3947 3013.8904 3039.8483 3054.9931 3059.9864 3067.2534 3084.1059 3089.6980 3124.0484 3136.3444 3150.3201 3161.3563 3169.2528 3439.8924 3570.0123
redmass: 4.9993 3.6995 3.1803 4.0307 4.3801 3.6149 3.9595 1.2907 3.2359 1.9392 3.6773 3.0495 2.8293 2.4065 2.8428 2.2457 2.8512 4.4355 3.7704 6.0512 1.9706 4.8709 2.7253 1.9509 4.0550 2.9543 2.4636 1.4128 3.4071 2.5680 1.2472 2.5304 1.8987 2.5803 2.2383 1.4964 1.9708 1.7216 2.5747 2.3442 1.7113 1.3863 1.5099 2.1625 1.4190 2.4060 1.5935 1.4287 1.1565 1.2856 1.5548 1.0719 2.5319 1.1483 2.0974 1.5536 2.1787 1.5096 1.4002 1.7976 1.5953 1.7899 1.6019 1.3726 1.5281 9.0585 2.2782 1.0827 2.1841 1.0819 1.0979 1.1010 8.5588 6.7354 5.9296 1.1134 1.0590 1.0613 1.0624 1.0610 1.1034 1.0971 1.0980 1.1008 1.1049 1.0903 1.0852 1.0891 1.0936 1.0963 1.0988 1.0444 1.0978
irintensity: 1.7555 0.2749 1.1988 1.8890 0.0533 2.8063 2.8249 22.6931 6.1961 9.4062 8.7543 4.2221 2.6192 7.7469 1.6265 1.8419 12.7395 3.9311 11.2205 4.1114 141.3730 53.1400 24.3332 67.0497 16.6766 3.6921 18.5465 5.2545 35.1237 14.5971 1.0531 9.3526 0.4646 48.3010 12.3908 6.2678 0.3125 0.8649 1.1591 1.6104 0.3360 2.8372 0.8452 1.6953 2.1795 14.5031 3.5199 8.6265 5.2026 3.3620 8.1211 0.6014 13.4131 35.2460 5.5615 43.2992 71.1359 4.7895 2.7235 27.9619 5.9789 6.4171 7.9261 2.4126 0.2271 4.5796 12.9034 2.1750 1.4395 9.3645 19.4005 8.3470 121.0440 19.4440 6.8404 39.9132 34.3942 30.9493 82.0198 29.5487 1.0175 36.5484 29.2608 74.4716 49.0936 10.2912 0.4340 15.6013 14.1286 13.2399 27.9464 1.8202 2.0212
temp: 298.150 k
press: 1.00000 atm
elementType: 8 7 6 6 6 6 6 6 6 6 6 6 6 6 6 6 1 1 1 1 1 1 1 1 1 1 1 1 1 1 1 1 1
symmnumber: 1
zpe: 730732.3 jmol-1
zpe.correction: 0.278321 hartree
zpe.thermalcorrener: 0.292015 hartree
zpe.thermalcorrenthalpy: 0.292959 hartree
zpe.thermalcorrgfe: 0.237797 hartree
zpe.sumelectzpe: -672.471293 hartree
zpe.sumelectthermal: -672.457599 hartree
zpe.sumelectthermalent: -672.456654 hartree
zpe.sumelectthermalfe: -672.511817 hartree
dipole: -0.5399 -2.6749 -0.2597
dipole: 2.7411
quadrupole: -84.1703 -96.8273 -94.1913
quadrupole: 0.6356 -3.9445 -3.4575
quadrupole: 7.5594 -5.0977 -2.4617 0.6356 -3.9445 -3.4575
hfenergy: -672.7496138 hartree
pointgroup: C01 [X(C14H17N1O1)]
dipole: 0.1398727 0.0072391 1.0693134 debye
polarizability: 201.2747482|-16.3997145|108.7427869|-3.7815408|-6.6752286|146.341358 unknown
InChI: InChI=1S/C14H17NO/c15-14(9-10-6-7-12(14)8-10)13(16)11-4-2-1-3-5-11/h1-5,10,12H,6-9,15H2
charge 0 multiplicity 1
33 atoms
O  0.038138 -0.396383 -2.168554
N  0.7076 -1.708697 0.87711
C  2.384395 -0.477005 -0.690806
C  2.564501 1.335786 0.684949
C  1.009017 -0.494375 0.08514
C  2.63867 1.04961 -0.843495
C  1.159107 0.769976 1.03332
C  3.529293 -0.879324 0.282456
C  3.647419 0.363559 1.242928
C  -0.175689 -0.316903 -0.922347
C  -1.567106 -0.021229 -0.424372
C  -2.507783 0.477771 -1.369071
C  -1.977046 -0.21016 0.924219
C  -3.823492 0.791445 -0.975221
C  -3.297369 0.099428 1.314592
C  -4.222743 0.603784 0.370516
H  2.346876 -1.055155 -1.626239
H  2.702326 2.385719 0.992749
H  1.860174 1.566215 -1.430169
H  3.6266 1.280959 -1.280903
H  1.069162 0.47473 2.095988
H  0.371464 1.518619 0.837603
H  4.464257 -1.032645 -0.285923
H  3.323319 -1.823206 0.81988
H  3.460309 0.106081 2.302349
H  4.653273 0.818233 1.187691
H  1.30146 -1.819619 1.705358
H  0.657185 -2.570404 0.322704
H  -2.179279 0.609296 -2.405485
H  -1.264869 -0.648581 1.628787
H  -4.537176 1.180351 -1.710064
H  -3.60858 -0.061178 2.352926
H  -5.247211 0.843601 0.677983
